Running: ./testmodel.py --libraries=/home/hudson/saved_omc/libraries/.openmodelica/libraries --ompython_omhome=/usr Buildings_9_Buildings.Fluid.HeatExchangers.DXCoils.BaseClasses.Examples.CoolingCapacityAirCooled.conf.json
loadFile("/home/hudson/saved_omc/libraries/.openmodelica/libraries/ModelicaServices 4.0.0+maint.om/package.mo", uses=false)
loadFile("/home/hudson/saved_omc/libraries/.openmodelica/libraries/Complex 4.0.0+maint.om/package.mo", uses=false)
loadFile("/home/hudson/saved_omc/libraries/.openmodelica/libraries/Modelica 4.0.0+maint.om/package.mo", uses=false)
loadFile("/home/hudson/saved_omc/libraries/.openmodelica/libraries/Buildings 9.1.3-maint.9.1.x/package.mo", uses=false)
Using package Buildings with version 9.1.3 (/home/hudson/saved_omc/libraries/.openmodelica/libraries/Buildings 9.1.3-maint.9.1.x/package.mo)
Using package Modelica with version 4.0.0 (/home/hudson/saved_omc/libraries/.openmodelica/libraries/Modelica 4.0.0+maint.om/package.mo)
Using package Complex with version 4.0.0 (/home/hudson/saved_omc/libraries/.openmodelica/libraries/Complex 4.0.0+maint.om/package.mo)
Using package ModelicaServices with version 4.0.0 (/home/hudson/saved_omc/libraries/.openmodelica/libraries/ModelicaServices 4.0.0+maint.om/package.mo)
Running command: translateModel(Buildings.Fluid.HeatExchangers.DXCoils.BaseClasses.Examples.CoolingCapacityAirCooled,tolerance=1e-06,outputFormat="mat",numberOfIntervals=5000,variableFilter="time|cooCap.TConIn|cooCap.TEvaIn|cooCap.m_flow|cooCap.Q_flow.1.|cooCap.EIR.1.",fileNamePrefix="Buildings_9_Buildings.Fluid.HeatExchangers.DXCoils.BaseClasses.Examples.CoolingCapacityAirCooled")
translateModel(Buildings.Fluid.HeatExchangers.DXCoils.BaseClasses.Examples.CoolingCapacityAirCooled,tolerance=1e-06,outputFormat="mat",numberOfIntervals=5000,variableFilter="time|cooCap.TConIn|cooCap.TEvaIn|cooCap.m_flow|cooCap.Q_flow.1.|cooCap.EIR.1.",fileNamePrefix="Buildings_9_Buildings.Fluid.HeatExchangers.DXCoils.BaseClasses.Examples.CoolingCapacityAirCooled")
Notification: Performance of loadFile(/home/hudson/saved_omc/libraries/.openmodelica/libraries/ModelicaServices 4.0.0+maint.om/package.mo): time 0.001582/0.001582, allocations: 102.9 kB / 15.98 MB, free: 6.34 MB / 14.72 MB
Notification: Performance of loadFile(/home/hudson/saved_omc/libraries/.openmodelica/libraries/Complex 4.0.0+maint.om/package.mo): time 0.001693/0.001693, allocations: 195.8 kB / 16.91 MB, free: 6.188 MB / 14.72 MB
Notification: Performance of loadFile(/home/hudson/saved_omc/libraries/.openmodelica/libraries/Modelica 4.0.0+maint.om/package.mo): time 1.441/1.441, allocations: 222.9 MB / 240.6 MB, free: 13.65 MB / 206.1 MB
Notification: Performance of loadFile(/home/hudson/saved_omc/libraries/.openmodelica/libraries/Buildings 9.1.3-maint.9.1.x/package.mo): time 2.331/2.331, allocations: 390.2 MB / 0.665 GB, free: 0.8984 MB / 0.5294 GB
Notification: Performance of FrontEnd - loaded program: time 0.001306/0.001306, allocations: 71.7 kB / 0.8127 GB, free: 32.5 MB / 0.6231 GB
Notification: Performance of FrontEnd - Absyn->SCode: time 0.2959/0.2972, allocations: 140.4 MB / 0.9498 GB, free: 9.203 MB / 0.7325 GB
Notification: Performance of NFInst.instantiate(Buildings.Fluid.HeatExchangers.DXCoils.BaseClasses.Examples.CoolingCapacityAirCooled): time 0.004133/0.3014, allocations: 2.407 MB / 0.9521 GB, free: 6.777 MB / 0.7325 GB
Notification: Performance of NFInst.instExpressions: time 0.002826/0.3043, allocations: 1.843 MB / 0.9539 GB, free: 4.926 MB / 0.7325 GB
Notification: Performance of NFInst.updateImplicitVariability: time 0.0002003/0.3045, allocations: 0 / 0.9539 GB, free: 4.926 MB / 0.7325 GB
Notification: Performance of NFTyping.typeComponents: time 0.0007931/0.3053, allocations: 223.2 kB / 0.9541 GB, free: 4.707 MB / 0.7325 GB
Notification: Performance of NFTyping.typeBindings: time 0.0001685/0.3055, allocations: 51.55 kB / 0.9542 GB, free: 4.656 MB / 0.7325 GB
[/home/hudson/saved_omc/libraries/.openmodelica/libraries/Buildings 9.1.3-maint.9.1.x/Fluid/HeatExchangers/DXCoils/BaseClasses/Functions/warnIfPerformanceOutOfBounds.mo:2:1-41:33:writable] Warning: Pure function ‘Buildings.Fluid.HeatExchangers.DXCoils.BaseClasses.Functions.warnIfPerformanceOutOfBounds‘ contains a call to impure function ‘Modelica.Utilities.Streams.print‘.
Notification: Performance of NFTyping.typeClassSections: time 0.001106/0.3066, allocations: 390.1 kB / 0.9546 GB, free: 4.285 MB / 0.7325 GB
Notification: Performance of NFFlatten.flatten: time 0.0004641/0.3071, allocations: 406.8 kB / 0.955 GB, free: 3.887 MB / 0.7325 GB
Notification: Performance of NFFlatten.resolveConnections: time 0.0001527/0.3073, allocations: 40.38 kB / 0.955 GB, free: 3.844 MB / 0.7325 GB
Notification: Performance of NFEvalConstants.evaluate: time 0.000168/0.3074, allocations: 163.5 kB / 0.9551 GB, free: 3.684 MB / 0.7325 GB
Notification: Performance of NFSimplifyModel.simplify: time 0.0001915/0.3076, allocations: 159.4 kB / 0.9553 GB, free: 3.527 MB / 0.7325 GB
Notification: Performance of NFPackage.collectConstants: time 5.074e-05/0.3077, allocations: 28 kB / 0.9553 GB, free: 3.5 MB / 0.7325 GB
Notification: Performance of NFFlatten.collectFunctions: time 0.0003575/0.3081, allocations: 247.7 kB / 0.9556 GB, free: 3.258 MB / 0.7325 GB
Notification: Performance of NFScalarize.scalarize: time 0.0001413/0.3082, allocations: 123.7 kB / 0.9557 GB, free: 3.137 MB / 0.7325 GB
Notification: Performance of NFVerifyModel.verify: time 0.000164/0.3084, allocations: 167.2 kB / 0.9558 GB, free: 2.973 MB / 0.7325 GB
Notification: Performance of NFConvertDAE.convert: time 0.0004745/0.3089, allocations: 475 kB / 0.9563 GB, free: 2.508 MB / 0.7325 GB
Notification: Performance of FrontEnd - DAE generated: time 5.18e-06/0.3089, allocations: 0 / 0.9563 GB, free: 2.508 MB / 0.7325 GB
Notification: Performance of FrontEnd: time 1.753e-06/0.3089, allocations: 3.938 kB / 0.9563 GB, free: 2.504 MB / 0.7325 GB
Notification: Performance of Transformations before backend: time 6.422e-06/0.3089, allocations: 0 / 0.9563 GB, free: 2.504 MB / 0.7325 GB
Notification: Model statistics after passing the front-end and creating the data structures used by the back-end:
 * Number of equations: 18
 * Number of variables: 18
Notification: Performance of Generate backend data structure: time 0.00116/0.3101, allocations: 0.71 MB / 0.957 GB, free: 1.738 MB / 0.7325 GB
Notification: Performance of prepare preOptimizeDAE: time 3.695e-05/0.3101, allocations: 8.031 kB / 0.957 GB, free: 1.73 MB / 0.7325 GB
Notification: Performance of preOpt normalInlineFunction (simulation): time 0.001708/0.3118, allocations: 156.3 kB / 0.9571 GB, free: 1.578 MB / 0.7325 GB
Notification: Performance of preOpt evaluateParameters (simulation): time 0.0004497/0.3123, allocations: 370.3 kB / 0.9575 GB, free: 1.176 MB / 0.7325 GB
Notification: Performance of preOpt simplifyIfEquations (simulation): time 0.000104/0.3124, allocations: 75.95 kB / 0.9576 GB, free: 1.09 MB / 0.7325 GB
Notification: Performance of preOpt expandDerOperator (simulation): time 4.579e-05/0.3124, allocations: 11.94 kB / 0.9576 GB, free: 1.078 MB / 0.7325 GB
Notification: Performance of preOpt clockPartitioning (simulation): time 0.0009879/0.3134, allocations: 435.6 kB / 0.958 GB, free: 0.6484 MB / 0.7325 GB
Notification: Performance of preOpt findStateOrder (simulation): time 8.807e-06/0.3135, allocations: 0 / 0.958 GB, free: 0.6484 MB / 0.7325 GB
Notification: Performance of preOpt replaceEdgeChange (simulation): time 3.603e-05/0.3135, allocations: 4 kB / 0.958 GB, free: 0.6445 MB / 0.7325 GB
Notification: Performance of preOpt inlineArrayEqn (simulation): time 7.253e-06/0.3135, allocations: 4 kB / 0.958 GB, free: 0.6406 MB / 0.7325 GB
Notification: Performance of preOpt removeEqualRHS (simulation): time 0.001442/0.315, allocations: 0.5893 MB / 0.9586 GB, free: 52 kB / 0.7325 GB
Notification: Performance of preOpt removeSimpleEquations (simulation): time 0.001744/0.3167, allocations: 1.05 MB / 0.9596 GB, free: 14.95 MB / 0.7481 GB
Notification: Performance of preOpt comSubExp (simulation): time 0.004985/0.3217, allocations: 0.8494 MB / 0.9604 GB, free: 14.09 MB / 0.7481 GB
Notification: Performance of preOpt resolveLoops (simulation): time 0.000716/0.3224, allocations: 308.6 kB / 0.9607 GB, free: 13.79 MB / 0.7481 GB
Notification: Performance of preOpt evalFunc (simulation): time 3.172e-05/0.3225, allocations: 7.984 kB / 0.9607 GB, free: 13.78 MB / 0.7481 GB
Notification: Performance of preOpt encapsulateWhenConditions (simulation): time 0.000982/0.3235, allocations: 441.4 kB / 0.9612 GB, free: 13.34 MB / 0.7481 GB
Notification: Performance of pre-optimization done (n=16): time 2.154e-06/0.3235, allocations: 0 / 0.9612 GB, free: 13.34 MB / 0.7481 GB
Notification: Performance of matching and sorting (n=16): time 0.002397/0.3259, allocations: 0.9187 MB / 0.9621 GB, free: 12.41 MB / 0.7481 GB
Notification: Performance of inlineWhenForInitialization (initialization): time 4.987e-05/0.326, allocations: 55.34 kB / 0.9621 GB, free: 12.34 MB / 0.7481 GB
Notification: Performance of selectInitializationVariablesDAE (initialization): time 0.0004966/0.3265, allocations: 441.5 kB / 0.9625 GB, free: 11.91 MB / 0.7481 GB
Notification: Performance of collectPreVariables (initialization): time 5.675e-05/0.3265, allocations: 33.7 kB / 0.9626 GB, free: 11.87 MB / 0.7481 GB
Notification: Performance of collectInitialEqns (initialization): time 0.0001296/0.3267, allocations: 172.1 kB / 0.9627 GB, free: 11.7 MB / 0.7481 GB
Notification: Performance of collectInitialBindings (initialization): time 6.856e-05/0.3267, allocations: 47.3 kB / 0.9628 GB, free: 11.65 MB / 0.7481 GB
Notification: Performance of simplifyInitialFunctions (initialization): time 0.0001372/0.3269, allocations: 57.67 kB / 0.9628 GB, free: 11.59 MB / 0.7481 GB
Notification: Performance of setup shared object (initialization): time 0.0001257/0.327, allocations: 342.8 kB / 0.9632 GB, free: 11.24 MB / 0.7481 GB
Notification: Performance of preBalanceInitialSystem (initialization): time 0.0008646/0.3279, allocations: 384.6 kB / 0.9635 GB, free: 10.86 MB / 0.7481 GB
Notification: Performance of partitionIndependentBlocks (initialization): time 0.0008189/0.3287, allocations: 371.7 kB / 0.9639 GB, free: 10.5 MB / 0.7481 GB
Notification: Performance of analyzeInitialSystem (initialization): time 0.001417/0.3301, allocations: 0.6062 MB / 0.9645 GB, free: 9.887 MB / 0.7481 GB
Notification: Performance of solveInitialSystemEqSystem (initialization): time 3.096e-06/0.3302, allocations: 0 / 0.9645 GB, free: 9.887 MB / 0.7481 GB
Notification: Performance of matching and sorting (n=18) (initialization): time 0.0019/0.3321, allocations: 0.9085 MB / 0.9654 GB, free: 8.965 MB / 0.7481 GB
Notification: Performance of prepare postOptimizeDAE: time 5.933e-05/0.3321, allocations: 45.69 kB / 0.9654 GB, free: 8.914 MB / 0.7481 GB
Notification: Performance of postOpt simplifyComplexFunction (initialization): time 5.951e-06/0.3321, allocations: 0 / 0.9654 GB, free: 8.914 MB / 0.7481 GB
Notification: Performance of postOpt tearingSystem (initialization): time 1.497e-05/0.3322, allocations: 0 / 0.9654 GB, free: 8.914 MB / 0.7481 GB
Notification: Performance of postOpt solveSimpleEquations (initialization): time 0.0004505/0.3326, allocations: 59.92 kB / 0.9655 GB, free: 8.855 MB / 0.7481 GB
Notification: Performance of postOpt calculateStrongComponentJacobians (initialization): time 1.141e-05/0.3326, allocations: 3.938 kB / 0.9655 GB, free: 8.852 MB / 0.7481 GB
Notification: Performance of postOpt simplifyAllExpressions (initialization): time 0.0003883/0.333, allocations: 43.95 kB / 0.9655 GB, free: 8.809 MB / 0.7481 GB
Notification: Performance of postOpt collapseArrayExpressions (initialization): time 4.483e-05/0.3331, allocations: 11.97 kB / 0.9655 GB, free: 8.797 MB / 0.7481 GB
Notification: Model statistics after passing the back-end for initialization:
 * Number of independent subsystems: 1
 * Number of states: 0 ()
 * Number of discrete variables: 7 (cooCap.checkBoundsTCon[1],$PRE.cooCap.checkBoundsTCon[1],cooCap.checkBoundsTEva[1],$PRE.cooCap.checkBoundsTEva[1],cooCap.stage,$whenCondition1,$whenCondition2)
 * Number of discrete states: 0 ()
 * Number of clocked states: 0 ()
 * Top-level inputs: 0
Notification: Strong component statistics for initialization (17):
 * Single equations (assignments): 16
 * Array equations: 0
 * Algorithm blocks: 1
 * Record equations: 0
 * When equations: 0
 * If-equations: 0
 * Equation systems (not torn): 0
 * Torn equation systems: 0
 * Mixed (continuous/discrete) equation systems: 0
Notification: Performance of prepare postOptimizeDAE: time 0.0002469/0.3333, allocations: 193.8 kB / 0.9657 GB, free: 8.602 MB / 0.7481 GB
Notification: Performance of postOpt lateInlineFunction (simulation): time 7.982e-05/0.3334, allocations: 39.52 kB / 0.9657 GB, free: 8.562 MB / 0.7481 GB
Notification: Performance of postOpt wrapFunctionCalls (simulation): time 7.787e-05/0.3335, allocations: 43.47 kB / 0.9658 GB, free: 8.516 MB / 0.7481 GB
Notification: Performance of postOpt inlineArrayEqn (simulation): time 5.219e-06/0.3335, allocations: 11.88 kB / 0.9658 GB, free: 8.504 MB / 0.7481 GB
Notification: Performance of postOpt constantLinearSystem (simulation): time 7.314e-06/0.3335, allocations: 3.938 kB / 0.9658 GB, free: 8.5 MB / 0.7481 GB
Notification: Performance of postOpt simplifysemiLinear (simulation): time 3.888e-06/0.3335, allocations: 0 / 0.9658 GB, free: 8.5 MB / 0.7481 GB
Notification: Performance of postOpt removeSimpleEquations (simulation): time 0.0005625/0.3341, allocations: 0.5439 MB / 0.9663 GB, free: 7.906 MB / 0.7481 GB
Notification: Performance of postOpt simplifyComplexFunction (simulation): time 2.424e-06/0.3341, allocations: 0 / 0.9663 GB, free: 7.906 MB / 0.7481 GB
Notification: Performance of postOpt solveSimpleEquations (simulation): time 0.0004302/0.3346, allocations: 59.92 kB / 0.9664 GB, free: 7.848 MB / 0.7481 GB
Notification: Performance of postOpt tearingSystem (simulation): time 4.518e-06/0.3346, allocations: 7.984 kB / 0.9664 GB, free: 7.84 MB / 0.7481 GB
Notification: Performance of postOpt inputDerivativesUsed (simulation): time 3.077e-05/0.3346, allocations: 7.984 kB / 0.9664 GB, free: 7.832 MB / 0.7481 GB
Notification: Performance of postOpt calculateStrongComponentJacobians (simulation): time 2.004e-06/0.3346, allocations: 4 kB / 0.9664 GB, free: 7.828 MB / 0.7481 GB
Notification: Performance of postOpt calculateStateSetsJacobians (simulation): time 2.405e-06/0.3346, allocations: 3.938 kB / 0.9664 GB, free: 7.824 MB / 0.7481 GB
Notification: Performance of postOpt symbolicJacobian (simulation): time 0.001558/0.3362, allocations: 0.6591 MB / 0.967 GB, free: 7.148 MB / 0.7481 GB
Notification: Performance of postOpt removeConstants (simulation): time 0.0002028/0.3364, allocations: 164.7 kB / 0.9672 GB, free: 6.969 MB / 0.7481 GB
Notification: Performance of postOpt simplifyTimeIndepFuncCalls (simulation): time 6.379e-05/0.3365, allocations: 4 kB / 0.9672 GB, free: 6.965 MB / 0.7481 GB
Notification: Performance of postOpt simplifyAllExpressions (simulation): time 0.0004307/0.3369, allocations: 47.94 kB / 0.9673 GB, free: 6.918 MB / 0.7481 GB
Notification: Performance of postOpt findZeroCrossings (simulation): time 8.335e-05/0.337, allocations: 23.91 kB / 0.9673 GB, free: 6.895 MB / 0.7481 GB
Notification: Performance of postOpt collapseArrayExpressions (simulation): time 3.465e-05/0.3371, allocations: 11.98 kB / 0.9673 GB, free: 6.883 MB / 0.7481 GB
Notification: Performance of sorting global known variables: time 0.0003422/0.3374, allocations: 323.1 kB / 0.9676 GB, free: 6.57 MB / 0.7481 GB
Notification: Performance of sort global known variables: time 3.71e-07/0.3374, allocations: 0 / 0.9676 GB, free: 6.57 MB / 0.7481 GB
Notification: Performance of remove unused functions: time 0.0003789/0.3378, allocations: 80.25 kB / 0.9677 GB, free: 6.492 MB / 0.7481 GB
Notification: Model statistics after passing the back-end for simulation:
 * Number of independent subsystems: 1
 * Number of states: 0 ()
 * Number of discrete variables: 5 ($whenCondition2,$whenCondition1,cooCap.stage,cooCap.checkBoundsTEva[1],cooCap.checkBoundsTCon[1])
 * Number of discrete states: 3 (cooCap.stage,cooCap.checkBoundsTEva[cooCap.stage],cooCap.checkBoundsTCon[cooCap.stage])
 * Number of clocked states: 0 ()
 * Top-level inputs: 0
Notification: Strong component statistics for simulation (16):
 * Single equations (assignments): 14
 * Array equations: 0
 * Algorithm blocks: 0
 * Record equations: 0
 * When equations: 2
 * If-equations: 0
 * Equation systems (not torn): 0
 * Torn equation systems: 0
 * Mixed (continuous/discrete) equation systems: 0
Notification: Performance of Backend phase and start with SimCode phase: time 0.0004964/0.3383, allocations: 159.9 kB / 0.9678 GB, free: 6.336 MB / 0.7481 GB
Notification: Performance of simCode: created initialization part: time 0.001868/0.3402, allocations: 0.7722 MB / 0.9686 GB, free: 5.551 MB / 0.7481 GB
Notification: Performance of simCode: created event and clocks part: time 4.148e-06/0.3402, allocations: 3.938 kB / 0.9686 GB, free: 5.547 MB / 0.7481 GB
Notification: Performance of simCode: created simulation system equations: time 0.0008177/0.341, allocations: 327.8 kB / 0.9689 GB, free: 5.227 MB / 0.7481 GB
Notification: Performance of simCode: created of all other equations (e.g. parameter, nominal, assert, etc): time 0.0004682/0.3415, allocations: 74.2 kB / 0.969 GB, free: 5.156 MB / 0.7481 GB
Notification: Performance of simCode: created linear, non-linear and system jacobian parts: time 0.001912/0.3434, allocations: 0.9262 MB / 0.9699 GB, free: 4.199 MB / 0.7481 GB
Notification: Performance of simCode: some other stuff during SimCode phase: time 0.0005005/0.3439, allocations: 0.8143 MB / 0.9707 GB, free: 3.359 MB / 0.7481 GB
Notification: Performance of simCode: all other stuff during SimCode phase: time 0.0001936/0.3441, allocations: 43.39 kB / 0.9707 GB, free: 3.316 MB / 0.7481 GB
Notification: Performance of SimCode: time 3.5e-07/0.3441, allocations: 0 / 0.9707 GB, free: 3.316 MB / 0.7481 GB
Notification: Performance of Templates: time 0.01162/0.3558, allocations: 6.18 MB / 0.9767 GB, free: 13.17 MB / 0.7637 GB
make -j1 -f Buildings_9_Buildings.Fluid.HeatExchangers.DXCoils.BaseClasses.Examples.CoolingCapacityAirCooled.makefile
make -j1 -f Buildings_9_Buildings.Fluid.HeatExchangers.DXCoils.BaseClasses.Examples.CoolingCapacityAirCooled.makefile clang++ -std=c++14  -fopenmp=libomp  -Winvalid-pch -O2 -g -DNDEBUG -fPIC   -std=c++11 -DBOOST_ALL_DYN_LINK   -DUSE_DGESV -DUSE_LOGGER -DOMC_BUILD -DUSE_THREAD -DSUNDIALS_MAJOR_VERSION=5 -DSUNDIALS_MINOR_VERSION=4 -DPMC_USE_SUNDIALS -I"." -I"/var/lib/jenkins1/ws/OpenModelicaLibraryTestingWork/OpenModelica/OMCompiler/build/bin/../include/omc/cpp/" -I. "-I/home/hudson/saved_omc/libraries/.openmodelica/libraries/Modelica 4.0.0+maint.om/Resources/C-Sources" -I"." -I"." -I"/var/lib/jenkins1/ws/OpenModelicaLibraryTestingWork/OpenModelica/OMCompiler/build/include/omc/sundials" "-I/home/hudson/saved_omc/libraries/.openmodelica/libraries/Modelica 4.0.0+maint.om/Resources/C-Sources"    -DMEASURETIME_PROFILEBLOCKS -DUSE_LOGGER  -c -o OMCppBuildings_9_Buildings.Fluid.HeatExchangers.DXCoils.BaseClasses.Examples.CoolingCapacityAirCooledCalcHelperMain.o OMCppBuildings_9_Buildings.Fluid.HeatExchangers.DXCoils.BaseClasses.Examples.CoolingCapacityAirCooledCalcHelperMain.cpp
In file included from OMCppBuildings_9_Buildings.Fluid.HeatExchangers.DXCoils.BaseClasses.Examples.CoolingCapacityAirCooledCalcHelperMain.cpp:29:
./OMCppBuildings_9_Buildings.Fluid.HeatExchangers.DXCoils.BaseClasses.Examples.CoolingCapacityAirCooledInitialize.cpp:458:106: error: use of undeclared identifier 'cooCap_P_staiSta__P_nomVal_P_TEvaIn_nominal_'
      _functions->Buildings_Utilities_Math_Functions_biquadratic(cooCap_P_staiSta__P_perCur_P_capFunT_, (cooCap_P_staiSta__P_nomVal_P_TEvaIn_nominal_ - 273.15), (cooCap_P_staiSta__P_nomVal_P_TConIn_nominal_ - 273.15), tmp40);
                                                                                                         ^
./OMCppBuildings_9_Buildings.Fluid.HeatExchangers.DXCoils.BaseClasses.Examples.CoolingCapacityAirCooledInitialize.cpp:458:163: error: use of undeclared identifier 'cooCap_P_staiSta__P_nomVal_P_TConIn_nominal_'
      _functions->Buildings_Utilities_Math_Functions_biquadratic(cooCap_P_staiSta__P_perCur_P_capFunT_, (cooCap_P_staiSta__P_nomVal_P_TEvaIn_nominal_ - 273.15), (cooCap_P_staiSta__P_nomVal_P_TConIn_nominal_ - 273.15), tmp40);
                                                                                                                                                                  ^
./OMCppBuildings_9_Buildings.Fluid.HeatExchangers.DXCoils.BaseClasses.Examples.CoolingCapacityAirCooledInitialize.cpp:458:66: error: use of undeclared identifier 'cooCap_P_staiSta__P_perCur_P_capFunT_'; did you mean '_cooCap_P_sta1_P_perCur_P_capFunT_'?
      _functions->Buildings_Utilities_Math_Functions_biquadratic(cooCap_P_staiSta__P_perCur_P_capFunT_, (cooCap_P_staiSta__P_nomVal_P_TEvaIn_nominal_ - 273.15), (cooCap_P_staiSta__P_nomVal_P_TConIn_nominal_ - 273.15), tmp40);
                                                                 ^~~~~~~~~~~~~~~~~~~~~~~~~~~~~~~~~~~~~
                                                                 _cooCap_P_sta1_P_perCur_P_capFunT_
./OMCppBuildings_9_Buildings.Fluid.HeatExchangers.DXCoils.BaseClasses.Examples.CoolingCapacityAirCooled.h:214:36: note: '_cooCap_P_sta1_P_perCur_P_capFunT_' declared here
    StatArrayDim1<double, 6, true> _cooCap_P_sta1_P_perCur_P_capFunT_;
                                   ^
In file included from OMCppBuildings_9_Buildings.Fluid.HeatExchangers.DXCoils.BaseClasses.Examples.CoolingCapacityAirCooledCalcHelperMain.cpp:29:
./OMCppBuildings_9_Buildings.Fluid.HeatExchangers.DXCoils.BaseClasses.Examples.CoolingCapacityAirCooledInitialize.cpp:464:69: error: use of undeclared identifier 'cooCap_P_staiSta__P_perCur_P_capFunFF_'
      _functions->Buildings_Fluid_Utilities_extendedPolynomial(1.0, cooCap_P_staiSta__P_perCur_P_capFunFF_, cooCap_P_staiSta__P_perCur_P_ffMin_, cooCap_P_staiSta__P_perCur_P_ffMax_, tmp43);
                                                                    ^
./OMCppBuildings_9_Buildings.Fluid.HeatExchangers.DXCoils.BaseClasses.Examples.CoolingCapacityAirCooledInitialize.cpp:464:109: error: use of undeclared identifier 'cooCap_P_staiSta__P_perCur_P_ffMin_'
      _functions->Buildings_Fluid_Utilities_extendedPolynomial(1.0, cooCap_P_staiSta__P_perCur_P_capFunFF_, cooCap_P_staiSta__P_perCur_P_ffMin_, cooCap_P_staiSta__P_perCur_P_ffMax_, tmp43);
                                                                                                            ^
./OMCppBuildings_9_Buildings.Fluid.HeatExchangers.DXCoils.BaseClasses.Examples.CoolingCapacityAirCooledInitialize.cpp:464:146: error: use of undeclared identifier 'cooCap_P_staiSta__P_perCur_P_ffMax_'
      _functions->Buildings_Fluid_Utilities_extendedPolynomial(1.0, cooCap_P_staiSta__P_perCur_P_capFunFF_, cooCap_P_staiSta__P_perCur_P_ffMin_, cooCap_P_staiSta__P_perCur_P_ffMax_, tmp43);
                                                                                                                                                 ^
./OMCppBuildings_9_Buildings.Fluid.HeatExchangers.DXCoils.BaseClasses.Examples.CoolingCapacityAirCooledInitialize.cpp:470:106: error: use of undeclared identifier 'cooCap_P_staiSta__P_nomVal_P_TEvaIn_nominal_'
      _functions->Buildings_Utilities_Math_Functions_biquadratic(cooCap_P_staiSta__P_perCur_P_EIRFunT_, (cooCap_P_staiSta__P_nomVal_P_TEvaIn_nominal_ - 273.15), (cooCap_P_staiSta__P_nomVal_P_TConIn_nominal_ - 273.15), tmp46);
                                                                                                         ^
./OMCppBuildings_9_Buildings.Fluid.HeatExchangers.DXCoils.BaseClasses.Examples.CoolingCapacityAirCooledInitialize.cpp:470:163: error: use of undeclared identifier 'cooCap_P_staiSta__P_nomVal_P_TConIn_nominal_'
      _functions->Buildings_Utilities_Math_Functions_biquadratic(cooCap_P_staiSta__P_perCur_P_EIRFunT_, (cooCap_P_staiSta__P_nomVal_P_TEvaIn_nominal_ - 273.15), (cooCap_P_staiSta__P_nomVal_P_TConIn_nominal_ - 273.15), tmp46);
                                                                                                                                                                  ^
./OMCppBuildings_9_Buildings.Fluid.HeatExchangers.DXCoils.BaseClasses.Examples.CoolingCapacityAirCooledInitialize.cpp:470:66: error: use of undeclared identifier 'cooCap_P_staiSta__P_perCur_P_EIRFunT_'; did you mean '_cooCap_P_sta1_P_perCur_P_EIRFunT_'?
      _functions->Buildings_Utilities_Math_Functions_biquadratic(cooCap_P_staiSta__P_perCur_P_EIRFunT_, (cooCap_P_staiSta__P_nomVal_P_TEvaIn_nominal_ - 273.15), (cooCap_P_staiSta__P_nomVal_P_TConIn_nominal_ - 273.15), tmp46);
                                                                 ^~~~~~~~~~~~~~~~~~~~~~~~~~~~~~~~~~~~~
                                                                 _cooCap_P_sta1_P_perCur_P_EIRFunT_
./OMCppBuildings_9_Buildings.Fluid.HeatExchangers.DXCoils.BaseClasses.Examples.CoolingCapacityAirCooled.h:208:36: note: '_cooCap_P_sta1_P_perCur_P_EIRFunT_' declared here
    StatArrayDim1<double, 6, true> _cooCap_P_sta1_P_perCur_P_EIRFunT_;
                                   ^
In file included from OMCppBuildings_9_Buildings.Fluid.HeatExchangers.DXCoils.BaseClasses.Examples.CoolingCapacityAirCooledCalcHelperMain.cpp:29:
./OMCppBuildings_9_Buildings.Fluid.HeatExchangers.DXCoils.BaseClasses.Examples.CoolingCapacityAirCooledInitialize.cpp:476:69: error: use of undeclared identifier 'cooCap_P_staiSta__P_perCur_P_EIRFunFF_'
      _functions->Buildings_Fluid_Utilities_extendedPolynomial(1.0, cooCap_P_staiSta__P_perCur_P_EIRFunFF_, cooCap_P_staiSta__P_perCur_P_ffMin_, cooCap_P_staiSta__P_perCur_P_ffMax_, tmp49);
                                                                    ^
./OMCppBuildings_9_Buildings.Fluid.HeatExchangers.DXCoils.BaseClasses.Examples.CoolingCapacityAirCooledInitialize.cpp:476:109: error: use of undeclared identifier 'cooCap_P_staiSta__P_perCur_P_ffMin_'
      _functions->Buildings_Fluid_Utilities_extendedPolynomial(1.0, cooCap_P_staiSta__P_perCur_P_EIRFunFF_, cooCap_P_staiSta__P_perCur_P_ffMin_, cooCap_P_staiSta__P_perCur_P_ffMax_, tmp49);
                                                                                                            ^
./OMCppBuildings_9_Buildings.Fluid.HeatExchangers.DXCoils.BaseClasses.Examples.CoolingCapacityAirCooledInitialize.cpp:476:146: error: use of undeclared identifier 'cooCap_P_staiSta__P_perCur_P_ffMax_'
      _functions->Buildings_Fluid_Utilities_extendedPolynomial(1.0, cooCap_P_staiSta__P_perCur_P_EIRFunFF_, cooCap_P_staiSta__P_perCur_P_ffMin_, cooCap_P_staiSta__P_perCur_P_ffMax_, tmp49);
                                                                                                                                                 ^
./OMCppBuildings_9_Buildings.Fluid.HeatExchangers.DXCoils.BaseClasses.Examples.CoolingCapacityAirCooledInitialize.cpp:461:7: warning: expression result unused [-Wunused-value]
      tmp42;
      ^~~~~
./OMCppBuildings_9_Buildings.Fluid.HeatExchangers.DXCoils.BaseClasses.Examples.CoolingCapacityAirCooledInitialize.cpp:467:7: warning: expression result unused [-Wunused-value]
      tmp45;
      ^~~~~
./OMCppBuildings_9_Buildings.Fluid.HeatExchangers.DXCoils.BaseClasses.Examples.CoolingCapacityAirCooledInitialize.cpp:473:7: warning: expression result unused [-Wunused-value]
      tmp48;
      ^~~~~
./OMCppBuildings_9_Buildings.Fluid.HeatExchangers.DXCoils.BaseClasses.Examples.CoolingCapacityAirCooledInitialize.cpp:479:7: warning: expression result unused [-Wunused-value]
      tmp51;
      ^~~~~
./OMCppBuildings_9_Buildings.Fluid.HeatExchangers.DXCoils.BaseClasses.Examples.CoolingCapacityAirCooledInitialize.cpp:518:104: error: no matching function for call to object of type 'WrapArray<bool>'
  SystemDefaultImplementation::setBoolStartValue(__omcQ_24whenCondition1_, ((_cooCap_P_stage_ == 1) && _discrete_events->pre(_cooCap_P_checkBoundsTEva_)(_cooCap_P_stage_)), false);
                                                                                                       ^~~~~~~~~~~~~~~~~~~~~~~~~~~~~~~~~~~~~~~~~~~~~~~~~
/var/lib/jenkins1/ws/OpenModelicaLibraryTestingWork/OpenModelica/OMCompiler/build/bin/../include/omc/cpp/Core/Math/Array.h:704:14: note: candidate function not viable: no known conversion from 'int' to 'const vector<size_t>' (aka 'const vector<unsigned long>') for 1st argument
  virtual T& operator()(const vector<size_t>& idx)
             ^
/var/lib/jenkins1/ws/OpenModelicaLibraryTestingWork/OpenModelica/OMCompiler/build/bin/../include/omc/cpp/Core/Math/Array.h:695:20: note: candidate function not viable: no known conversion from 'int' to 'const vector<size_t>' (aka 'const vector<unsigned long>') for 1st argument
  virtual const T& operator()(const vector<size_t>& idx) const
                   ^
In file included from OMCppBuildings_9_Buildings.Fluid.HeatExchangers.DXCoils.BaseClasses.Examples.CoolingCapacityAirCooledCalcHelperMain.cpp:29:
./OMCppBuildings_9_Buildings.Fluid.HeatExchangers.DXCoils.BaseClasses.Examples.CoolingCapacityAirCooledInitialize.cpp:537:104: error: no matching function for call to object of type 'WrapArray<bool>'
  SystemDefaultImplementation::setBoolStartValue(__omcQ_24whenCondition2_, ((_cooCap_P_stage_ == 1) && _discrete_events->pre(_cooCap_P_checkBoundsTCon_)(_cooCap_P_stage_)), false);
                                                                                                       ^~~~~~~~~~~~~~~~~~~~~~~~~~~~~~~~~~~~~~~~~~~~~~~~~
/var/lib/jenkins1/ws/OpenModelicaLibraryTestingWork/OpenModelica/OMCompiler/build/bin/../include/omc/cpp/Core/Math/Array.h:704:14: note: candidate function not viable: no known conversion from 'int' to 'const vector<size_t>' (aka 'const vector<unsigned long>') for 1st argument
  virtual T& operator()(const vector<size_t>& idx)
             ^
/var/lib/jenkins1/ws/OpenModelicaLibraryTestingWork/OpenModelica/OMCompiler/build/bin/../include/omc/cpp/Core/Math/Array.h:695:20: note: candidate function not viable: no known conversion from 'int' to 'const vector<size_t>' (aka 'const vector<unsigned long>') for 1st argument
  virtual const T& operator()(const vector<size_t>& idx) const
                   ^
In file included from OMCppBuildings_9_Buildings.Fluid.HeatExchangers.DXCoils.BaseClasses.Examples.CoolingCapacityAirCooledCalcHelperMain.cpp:33:
./OMCppBuildings_9_Buildings.Fluid.HeatExchangers.DXCoils.BaseClasses.Examples.CoolingCapacityAirCooled.cpp:500:29: error: use of undeclared identifier 'cooCap_P_stacooCap_P_stage__P_perCur_P_TConInMax_'
    if (!(!((_TConIn_P_y_ > cooCap_P_stacooCap_P_stage__P_perCur_P_TConInMax_) || (_TConIn_P_y_ < cooCap_P_stacooCap_P_stage__P_perCur_P_TConInMin_))))
                            ^
./OMCppBuildings_9_Buildings.Fluid.HeatExchangers.DXCoils.BaseClasses.Examples.CoolingCapacityAirCooled.cpp:500:99: error: use of undeclared identifier 'cooCap_P_stacooCap_P_stage__P_perCur_P_TConInMin_'
    if (!(!((_TConIn_P_y_ > cooCap_P_stacooCap_P_stage__P_perCur_P_TConInMax_) || (_TConIn_P_y_ < cooCap_P_stacooCap_P_stage__P_perCur_P_TConInMin_))))
                                                                                                  ^
./OMCppBuildings_9_Buildings.Fluid.HeatExchangers.DXCoils.BaseClasses.Examples.CoolingCapacityAirCooled.cpp:540:32: error: use of undeclared identifier 'cooCap_P_stacooCap_P_stage__P_perCur_P_TEvaInMax_'
    if (!(!((_TWetBulIn_P_y_ > cooCap_P_stacooCap_P_stage__P_perCur_P_TEvaInMax_) || (_TWetBulIn_P_y_ < cooCap_P_stacooCap_P_stage__P_perCur_P_TEvaInMin_))))
                               ^
./OMCppBuildings_9_Buildings.Fluid.HeatExchangers.DXCoils.BaseClasses.Examples.CoolingCapacityAirCooled.cpp:540:105: error: use of undeclared identifier 'cooCap_P_stacooCap_P_stage__P_perCur_P_TEvaInMin_'
    if (!(!((_TWetBulIn_P_y_ > cooCap_P_stacooCap_P_stage__P_perCur_P_TEvaInMax_) || (_TWetBulIn_P_y_ < cooCap_P_stacooCap_P_stage__P_perCur_P_TEvaInMin_))))
                                                                                                        ^
4 warnings and 18 errors generated.
make: *** [<builtin>: OMCppBuildings_9_Buildings.Fluid.HeatExchangers.DXCoils.BaseClasses.Examples.CoolingCapacityAirCooledCalcHelperMain.o] Error 1