Running: ./testmodel.py --libraries=/home/hudson/saved_omc/libraries/.openmodelica/libraries --ompython_omhome=/usr ModelicaTest_trunk_ModelicaTest.Fluid.TestComponents.Valves.TestValveIncompressible.conf.json
loadFile("/home/hudson/saved_omc/libraries/.openmodelica/libraries/ModelicaServices trunk/package.mo", uses=false) [Timeout 180]
"Notification: Performance of loadFile(/home/hudson/saved_omc/libraries/.openmodelica/libraries/ModelicaServices trunk/package.mo): time 0.001432/0.001432, allocations: 113.1 kB / 21.86 MB, free: 68 kB / 14.72 MB
"
[Timeout remaining time 180]
loadFile("/home/hudson/saved_omc/libraries/.openmodelica/libraries/Complex trunk/package.mo", uses=false) [Timeout 180]
"Notification: Performance of loadFile(/home/hudson/saved_omc/libraries/.openmodelica/libraries/Complex trunk/package.mo): time 0.001534/0.001534, allocations: 213.5 kB / 25.15 MB, free: 3.582 MB / 14.72 MB
"
[Timeout remaining time 180]
loadFile("/home/hudson/saved_omc/libraries/.openmodelica/libraries/Modelica trunk/package.mo", uses=false) [Timeout 180]
"Notification: Performance of loadFile(/home/hudson/saved_omc/libraries/.openmodelica/libraries/Modelica trunk/package.mo): time 1.296/1.296, allocations: 230.2 MB / 258.5 MB, free: 8.262 MB / 206.1 MB
"
[Timeout remaining time 179]
loadFile("/home/hudson/saved_omc/libraries/.openmodelica/libraries/ModelicaTest trunk/package.mo", uses=false) [Timeout 180]
"Notification: Performance of loadFile(/home/hudson/saved_omc/libraries/.openmodelica/libraries/ModelicaTest trunk/package.mo): time 0.1949/0.1949, allocations: 46.88 MB / 361.8 MB, free: 4.445 MB / 286.1 MB
"
[Timeout remaining time 180]
Using package ModelicaTest with version trunk (/home/hudson/saved_omc/libraries/.openmodelica/libraries/ModelicaTest trunk/package.mo)
Using package Modelica with version trunk (/home/hudson/saved_omc/libraries/.openmodelica/libraries/Modelica trunk/package.mo)
Using package Complex with version trunk (/home/hudson/saved_omc/libraries/.openmodelica/libraries/Complex trunk/package.mo)
Using package ModelicaServices with version trunk (/home/hudson/saved_omc/libraries/.openmodelica/libraries/ModelicaServices trunk/package.mo)
Running command: translateModel(ModelicaTest.Fluid.TestComponents.Valves.TestValveIncompressible,tolerance=1e-06,outputFormat="mat",numberOfIntervals=5002,variableFilter="time|SourceP1.ports.1..m_flow|SourceP1.ports.1..p|SourceP1.ports.1..h_outflow|V1.port_b.m_flow|V1.port_b.p|V1.port_b.h_outflow|V1.minLimiter.y|SinkP1.ports.1..m_flow|SinkP1.ports.1..p|SinkP1.ports.1..h_outflow|Opening.y|SourceP2.ports.1..m_flow|SourceP2.ports.1..p|SourceP2.ports.1..h_outflow|V2.port_b.m_flow|V2.port_b.p|V2.port_b.h_outflow|V2.minLimiter.y|SinkP2.ports.1..m_flow|SinkP2.ports.1..p|SinkP2.ports.1..h_outflow|SourceP3.ports.1..m_flow|SourceP3.ports.1..p|SourceP3.ports.1..h_outflow|V3.port_b.m_flow|V3.port_b.p|V3.port_b.h_outflow|V3.minLimiter.y|SinkP3.ports.1..m_flow|SinkP3.ports.1..p|SinkP3.ports.1..h_outflow",fileNamePrefix="ModelicaTest_trunk_ModelicaTest.Fluid.TestComponents.Valves.TestValveIncompressible")
translateModel(ModelicaTest.Fluid.TestComponents.Valves.TestValveIncompressible,tolerance=1e-06,outputFormat="mat",numberOfIntervals=5002,variableFilter="time|SourceP1.ports.1..m_flow|SourceP1.ports.1..p|SourceP1.ports.1..h_outflow|V1.port_b.m_flow|V1.port_b.p|V1.port_b.h_outflow|V1.minLimiter.y|SinkP1.ports.1..m_flow|SinkP1.ports.1..p|SinkP1.ports.1..h_outflow|Opening.y|SourceP2.ports.1..m_flow|SourceP2.ports.1..p|SourceP2.ports.1..h_outflow|V2.port_b.m_flow|V2.port_b.p|V2.port_b.h_outflow|V2.minLimiter.y|SinkP2.ports.1..m_flow|SinkP2.ports.1..p|SinkP2.ports.1..h_outflow|SourceP3.ports.1..m_flow|SourceP3.ports.1..p|SourceP3.ports.1..h_outflow|V3.port_b.m_flow|V3.port_b.p|V3.port_b.h_outflow|V3.minLimiter.y|SinkP3.ports.1..m_flow|SinkP3.ports.1..p|SinkP3.ports.1..h_outflow",fileNamePrefix="ModelicaTest_trunk_ModelicaTest.Fluid.TestComponents.Valves.TestValveIncompressible") [Timeout 660]
"Notification: Performance of FrontEnd - Absyn->SCode: time 1.765e-05/1.765e-05, allocations: 2.281 kB / 0.4973 GB, free: 7.738 MB / 366.1 MB
Notification: Performance of NFInst.instantiate(ModelicaTest.Fluid.TestComponents.Valves.TestValveIncompressible): time 0.2337/0.2338, allocations: 64.78 MB / 0.5606 GB, free: 12.56 MB / 398.1 MB
Notification: Performance of NFInst.instExpressions: time 0.03067/0.2644, allocations: 24.57 MB / 0.5846 GB, free: 9.16 MB / 414.1 MB
Notification: Performance of NFInst.updateImplicitVariability: time 0.00164/0.2661, allocations: 55.44 kB / 0.5846 GB, free: 9.105 MB / 414.1 MB
Notification: Performance of NFTyping.typeComponents: time 0.002071/0.2681, allocations: 0.7413 MB / 0.5854 GB, free: 8.359 MB / 414.1 MB
Notification: Performance of NFTyping.typeBindings: time 0.01284/0.281, allocations: 4.716 MB / 0.59 GB, free: 3.645 MB / 414.1 MB
Notification: Performance of NFTyping.typeClassSections: time 0.01202/0.293, allocations: 4.691 MB / 0.5946 GB, free: 14.96 MB / 430.1 MB
Notification: Performance of NFFlatten.flatten: time 0.004848/0.2978, allocations: 3.733 MB / 0.5982 GB, free: 11.21 MB / 430.1 MB
Notification: Performance of NFFlatten.resolveConnections: time 0.001318/0.2992, allocations: 0.9542 MB / 0.5991 GB, free: 10.25 MB / 430.1 MB
Notification: Performance of NFEvalConstants.evaluate: time 0.002574/0.3017, allocations: 1.616 MB / 0.6007 GB, free: 8.625 MB / 430.1 MB
Notification: Performance of NFSimplifyModel.simplify: time 0.001195/0.3029, allocations: 0.9106 MB / 0.6016 GB, free: 7.711 MB / 430.1 MB
Notification: Performance of NFPackage.collectConstants: time 0.0001547/0.3031, allocations: 104 kB / 0.6017 GB, free: 7.609 MB / 430.1 MB
Notification: Performance of NFFlatten.collectFunctions: time 0.01293/0.316, allocations: 7.539 MB / 0.6091 GB, free: 64 kB / 430.1 MB
Notification: Performance of combineBinaries: time 0.002436/0.3185, allocations: 2.664 MB / 0.6117 GB, free: 13.37 MB / 446.1 MB
Notification: Performance of replaceArrayConstructors: time 0.001216/0.3197, allocations: 1.667 MB / 0.6133 GB, free: 11.69 MB / 446.1 MB
Notification: Performance of NFVerifyModel.verify: time 0.0003189/0.32, allocations: 219.4 kB / 0.6135 GB, free: 11.47 MB / 446.1 MB
Notification: Performance of FrontEnd: time 0.0002727/0.3203, allocations: 51.78 kB / 0.6135 GB, free: 11.42 MB / 446.1 MB
Notification: Model statistics after passing the front-end and creating the data structures used by the back-end:
 * Number of equations: 226 (202)
 * Number of variables: 226 (226)
Notification: Performance of Bindings: time 0.006285/0.3266, allocations: 6.479 MB / 0.6199 GB, free: 4.727 MB / 446.1 MB
Notification: Performance of FunctionAlias: time 0.0006085/0.3272, allocations: 0.554 MB / 0.6204 GB, free: 4.156 MB / 446.1 MB
Notification: Performance of Early Inline: time 0.005444/0.3326, allocations: 5.131 MB / 0.6254 GB, free: 14.96 MB / 462.1 MB
Notification: Performance of Simplify 1: time 0.0009056/0.3335, allocations: 0.5847 MB / 0.626 GB, free: 14.31 MB / 462.1 MB
Notification: Performance of Alias: time 0.004784/0.3383, allocations: 3.988 MB / 0.6299 GB, free: 9.914 MB / 462.1 MB
Notification: Performance of Simplify 2: time 0.0007123/0.339, allocations: 0.5133 MB / 0.6304 GB, free: 9.328 MB / 462.1 MB
Notification: Performance of Remove Stream: time 0.0004251/0.3394, allocations: 404 kB / 0.6308 GB, free: 8.895 MB / 462.1 MB
Notification: Performance of Detect States: time 0.0008487/0.3403, allocations: 0.8866 MB / 0.6316 GB, free: 7.945 MB / 462.1 MB
Notification: Performance of Events: time 0.0009291/0.3412, allocations: 0.711 MB / 0.6323 GB, free: 7.25 MB / 462.1 MB
Notification: Performance of Partitioning: time 0.001786/0.343, allocations: 1.608 MB / 0.6339 GB, free: 5.395 MB / 462.1 MB
Notification: Performance of Causalize: time 0.006373/0.3494, allocations: 4.944 MB / 0.6387 GB, free: 184 kB / 462.1 MB
Notification: Performance of After Index Reduction Inline: time 0.003875/0.3532, allocations: 4.005 MB / 0.6427 GB, free: 12.17 MB / 478.1 MB
Notification: Performance of Simplify: time 0.002415/0.3557, allocations: 1.65 MB / 0.6443 GB, free: 10.3 MB / 478.1 MB
Notification: Performance of Inline: time 0.006293/0.362, allocations: 6.502 MB / 0.6506 GB, free: 3.785 MB / 478.1 MB
Notification: Performance of Partitioning: time 0.0001853/0.3621, allocations: 100.8 kB / 0.6507 GB, free: 3.652 MB / 478.1 MB
Notification: Performance of Cleanup: time 0.001325/0.3635, allocations: 1.269 MB / 0.6519 GB, free: 2.371 MB / 478.1 MB
Notification: Performance of Causalize: time 0.01639/0.3799, allocations: 12.48 MB / 0.6641 GB, free: 5.59 MB / 494.1 MB
Notification: Performance of Tearing: time 0.0001074/0.38, allocations: 144 kB / 0.6643 GB, free: 5.449 MB / 494.1 MB
Notification: Performance of Initialization: time 1.703e-06/0.38, allocations: 0 / 0.6643 GB, free: 5.449 MB / 494.1 MB
Notification: Performance of Remove Dummies: time 4.508e-05/0.38, allocations: 13.88 kB / 0.6643 GB, free: 5.434 MB / 494.1 MB
Notification: Performance of Tearing: time 4.117e-05/0.38, allocations: 67.88 kB / 0.6643 GB, free: 5.367 MB / 494.1 MB
Notification: Performance of Categorize: time 4.978e-05/0.3801, allocations: 12 kB / 0.6644 GB, free: 5.355 MB / 494.1 MB
Notification: Performance of Solve: time 0.009025/0.3891, allocations: 6.199 MB / 0.6704 GB, free: 15.13 MB / 0.4981 GB
Notification: Performance of Jacobian: time 4.769e-06/0.3891, allocations: 0 / 0.6704 GB, free: 15.13 MB / 0.4981 GB
Notification: Partition statistics after passing the back-end:
 * Number of ODE partitions: ..................... 0
 * Number of algebraic partitions: ............... 12
 * Number of ODE event partitions: ............... 0
 * Number of algebraic event partitions: ......... 19
 * Number of clocked partitions: ................. 0
 * Number of initial partitions: ................. 1
 * Number of initial(lambda=0) partitions: ....... 1
Notification: Variable statistics after passing the back-end:
 * Number of states: ............................. 0 (0) {}
 * Number of discrete states: .................... 0 (0) {}
 * Number of clocked states: ..................... 0 (0) {}
 * Number of discrete variables: ................. 72 (72) {SourceP1.medium.state.phase, SourceP1.medium.phase, V1.state_a.phase, V1.state_b.phase, SinkP1.medium.state.phase, SinkP1.medium.phase, SourceP2.medium.state.phase, SourceP2.medium.phase, V2.state_a.phase, V2.state_b.phase, SinkP2.medium.state.phase, SinkP2.medium.phase, SourceP3.medium.state.phase, SourceP3.medium.phase, V3.state_a.phase, V3.state_b.phase, SinkP3.medium.state.phase, SinkP3.medium.phase, $SEV_51, $SEV_50, $SEV_49, $SEV_48, $SEV_47, $SEV_46, $SEV_45, $SEV_44, $SEV_43, $SEV_42, $SEV_41, $SEV_40, $SEV_39, $SEV_38, $SEV_37, $SEV_36, $SEV_35, $SEV_34, $SEV_33, $SEV_32, $SEV_31, $SEV_30, $SEV_29, $SEV_28, $SEV_27, $SEV_26, $SEV_25, $SEV_24, $SEV_23, $SEV_22, $SEV_21, $SEV_20, $SEV_19, $SEV_18, $SEV_17, $SEV_16, $SEV_15, $SEV_14, $SEV_13, $SEV_12, $SEV_11, $SEV_10, $SEV_9, $SEV_8, $SEV_7, $SEV_6, $SEV_5, $SEV_4, $SEV_3, $SEV_2, $SEV_1, $SEV_0, $TEV_1, $TEV_0}
 * Number of clocks: ............................. 0 (0) {}
 * Number of top-level inputs: ................... 0 (0) {}
Notification: [Simulation] Strong Component statistics after passing the back-end:
 * Number of single strong components: ........... 213 (scalar:213, array:0, record:0)
 * Number of multi strong components: ............ 0 (algorithm:0, when:0, if:0, tuple:0)
 * Number of for-loop strong components: ......... 0 (resizable: 0, generic: 0, entwined:0)
 * Number of algebraic-loop strong components: ... 0 (linear: 0, nonlinear:0)
Notification: [Initialization] Strong Component statistics after passing the back-end:
 * Number of single strong components: ........... 273 (scalar:267, array:6, record:0)
 * Number of multi strong components: ............ 0 (algorithm:0, when:0, if:0, tuple:0)
 * Number of for-loop strong components: ......... 0 (resizable: 0, generic: 0, entwined:0)
 * Number of algebraic-loop strong components: ... 0 (linear: 0, nonlinear:0)
Notification: [Initialization (lambda=0)] Strong Component statistics after passing the back-end:
 * Number of single strong components: ........... 273 (scalar:267, array:6, record:0)
 * Number of multi strong components: ............ 0 (algorithm:0, when:0, if:0, tuple:0)
 * Number of for-loop strong components: ......... 0 (resizable: 0, generic: 0, entwined:0)
 * Number of algebraic-loop strong components: ... 0 (linear: 0, nonlinear:0)
Notification: Performance of backend: time 0.0001507/0.3893, allocations: 159.4 kB / 0.6706 GB, free: 14.98 MB / 0.4981 GB
Notification: Performance of SimCode: time 0.02605/0.4153, allocations: 14.35 MB / 0.6846 GB, free: 0.4961 MB / 0.4981 GB
Notification: Performance of Templates: time 0.2742/0.6895, allocations: 58.1 MB / 0.7413 GB, free: 115.4 MB / 0.545 GB
"
[Timeout remaining time 659]
make -j1 -f ModelicaTest_trunk_ModelicaTest.Fluid.TestComponents.Valves.TestValveIncompressible.makefile [Timeout 660]
make -j1 -f ModelicaTest_trunk_ModelicaTest.Fluid.TestComponents.Valves.TestValveIncompressible.makefile clang  -Os -DOM_HAVE_PTHREADS -fPIC -falign-functions -mfpmath=sse -fno-dollars-in-identifiers -Wno-parentheses-equality -Os -march=native    -I"/var/lib/jenkins/ws/OpenModelicaLibraryTestingWork/OpenModelica/OMCompiler/build/bin/../include/omc/c" -I"/var/lib/jenkins/ws/OpenModelicaLibraryTestingWork/OpenModelica/OMCompiler/build/bin/../include/omc" -I. -DOPENMODELICA_XML_FROM_FILE_AT_RUNTIME -DOMC_MODEL_PREFIX=ModelicaTest_trunk_ModelicaTest_Fluid_TestComponents_Valves_TestValveIncompressible -DOMC_NUM_MIXED_SYSTEMS=0 -DOMC_NUM_LINEAR_SYSTEMS=0 -DOMC_NUM_NONLINEAR_SYSTEMS=0 -DOMC_NDELAY_EXPRESSIONS=0 -DOMC_NVAR_STRING=0  -c -o ModelicaTest_trunk_ModelicaTest.Fluid.TestComponents.Valves.TestValveIncompressible.o ModelicaTest_trunk_ModelicaTest.Fluid.TestComponents.Valves.TestValveIncompressible.c
clang  -Os -DOM_HAVE_PTHREADS -fPIC -falign-functions -mfpmath=sse -fno-dollars-in-identifiers -Wno-parentheses-equality -Os -march=native    -I"/var/lib/jenkins/ws/OpenModelicaLibraryTestingWork/OpenModelica/OMCompiler/build/bin/../include/omc/c" -I"/var/lib/jenkins/ws/OpenModelicaLibraryTestingWork/OpenModelica/OMCompiler/build/bin/../include/omc" -I. -DOPENMODELICA_XML_FROM_FILE_AT_RUNTIME -DOMC_MODEL_PREFIX=ModelicaTest_trunk_ModelicaTest_Fluid_TestComponents_Valves_TestValveIncompressible -DOMC_NUM_MIXED_SYSTEMS=0 -DOMC_NUM_LINEAR_SYSTEMS=0 -DOMC_NUM_NONLINEAR_SYSTEMS=0 -DOMC_NDELAY_EXPRESSIONS=0 -DOMC_NVAR_STRING=0  -c -o ModelicaTest_trunk_ModelicaTest.Fluid.TestComponents.Valves.TestValveIncompressible_functions.o ModelicaTest_trunk_ModelicaTest.Fluid.TestComponents.Valves.TestValveIncompressible_functions.c
ModelicaTest_trunk_ModelicaTest.Fluid.TestComponents.Valves.TestValveIncompressible_functions.c:215:3: error: use of undeclared identifier '__omcQ_24fDER_5Faux_2Ep'; did you mean '__omcQ_24fDER_5Faux'?
  __omcQ_24fDER_5Faux_2Ep = 0.0;
  ^~~~~~~~~~~~~~~~~~~~~~~
  __omcQ_24fDER_5Faux
ModelicaTest_trunk_ModelicaTest.Fluid.TestComponents.Valves.TestValveIncompressible_functions.c:13:42: note: '__omcQ_24fDER_5Faux' declared here
  Modelica_Media_Common_IF97BaseTwoPhase __omcQ_24fDER_5Faux;
                                         ^
ModelicaTest_trunk_ModelicaTest.Fluid.TestComponents.Valves.TestValveIncompressible_functions.c:215:27: error: assigning to 'Modelica_Media_Common_IF97BaseTwoPhase' from incompatible type 'double'
  __omcQ_24fDER_5Faux_2Ep = 0.0;
                          ^ ~~~
ModelicaTest_trunk_ModelicaTest.Fluid.TestComponents.Valves.TestValveIncompressible_functions.c:219:3: error: use of undeclared identifier '__omcQ_24fDER_5Faux_2Eh'; did you mean '__omcQ_24fDER_5Faux'?
  __omcQ_24fDER_5Faux_2Eh = ((_h > 1000.0)?__omcQ_24fDER_5Fh:0.0);
  ^~~~~~~~~~~~~~~~~~~~~~~
  __omcQ_24fDER_5Faux
ModelicaTest_trunk_ModelicaTest.Fluid.TestComponents.Valves.TestValveIncompressible_functions.c:13:42: note: '__omcQ_24fDER_5Faux' declared here
  Modelica_Media_Common_IF97BaseTwoPhase __omcQ_24fDER_5Faux;
                                         ^
ModelicaTest_trunk_ModelicaTest.Fluid.TestComponents.Valves.TestValveIncompressible_functions.c:219:27: error: assigning to 'Modelica_Media_Common_IF97BaseTwoPhase' from incompatible type 'double'
  __omcQ_24fDER_5Faux_2Eh = ((_h > 1000.0)?__omcQ_24fDER_5Fh:0.0);
                          ^ ~~~~~~~~~~~~~~~~~~~~~~~~~~~~~~~~~~~~~
ModelicaTest_trunk_ModelicaTest.Fluid.TestComponents.Valves.TestValveIncompressible_functions.c:223:3: error: use of undeclared identifier '__omcQ_24fDER_5Faux_2ER_5Fs'; did you mean '__omcQ_24fDER_5Faux'?
  __omcQ_24fDER_5Faux_2ER_5Fs = 0.0;
  ^~~~~~~~~~~~~~~~~~~~~~~~~~~
  __omcQ_24fDER_5Faux
ModelicaTest_trunk_ModelicaTest.Fluid.TestComponents.Valves.TestValveIncompressible_functions.c:13:42: note: '__omcQ_24fDER_5Faux' declared here
  Modelica_Media_Common_IF97BaseTwoPhase __omcQ_24fDER_5Faux;
                                         ^
ModelicaTest_trunk_ModelicaTest.Fluid.TestComponents.Valves.TestValveIncompressible_functions.c:223:31: error: assigning to 'Modelica_Media_Common_IF97BaseTwoPhase' from incompatible type 'double'
  __omcQ_24fDER_5Faux_2ER_5Fs = 0.0;
                              ^ ~~~
ModelicaTest_trunk_ModelicaTest.Fluid.TestComponents.Valves.TestValveIncompressible_functions.c:227:3: error: use of undeclared identifier '__omcQ_24fDER_5Faux_2Evt'; did you mean '__omcQ_24fDER_5Faux'?
  __omcQ_24fDER_5Faux_2Evt = 0.0;
  ^~~~~~~~~~~~~~~~~~~~~~~~
  __omcQ_24fDER_5Faux
ModelicaTest_trunk_ModelicaTest.Fluid.TestComponents.Valves.TestValveIncompressible_functions.c:13:42: note: '__omcQ_24fDER_5Faux' declared here
  Modelica_Media_Common_IF97BaseTwoPhase __omcQ_24fDER_5Faux;
                                         ^
ModelicaTest_trunk_ModelicaTest.Fluid.TestComponents.Valves.TestValveIncompressible_functions.c:227:28: error: assigning to 'Modelica_Media_Common_IF97BaseTwoPhase' from incompatible type 'double'
  __omcQ_24fDER_5Faux_2Evt = 0.0;
                           ^ ~~~
ModelicaTest_trunk_ModelicaTest.Fluid.TestComponents.Valves.TestValveIncompressible_functions.c:231:3: error: use of undeclared identifier '__omcQ_24fDER_5Faux_2Evp'; did you mean '__omcQ_24fDER_5Faux'?
  __omcQ_24fDER_5Faux_2Evp = 0.0;
  ^~~~~~~~~~~~~~~~~~~~~~~~
  __omcQ_24fDER_5Faux
ModelicaTest_trunk_ModelicaTest.Fluid.TestComponents.Valves.TestValveIncompressible_functions.c:13:42: note: '__omcQ_24fDER_5Faux' declared here
  Modelica_Media_Common_IF97BaseTwoPhase __omcQ_24fDER_5Faux;
                                         ^
ModelicaTest_trunk_ModelicaTest.Fluid.TestComponents.Valves.TestValveIncompressible_functions.c:231:28: error: assigning to 'Modelica_Media_Common_IF97BaseTwoPhase' from incompatible type 'double'
  __omcQ_24fDER_5Faux_2Evp = 0.0;
                           ^ ~~~
ModelicaTest_trunk_ModelicaTest.Fluid.TestComponents.Valves.TestValveIncompressible_functions.c:237:5: error: use of undeclared identifier '__omcQ_24fDER_5Faux_2ET'; did you mean '__omcQ_24fDER_5Faux'?
    __omcQ_24fDER_5Faux_2ET = omc__omcQ_24fDER0_Modelica_Media_Water_IF97__Utilities_BaseIF97_Basic_tph1(threadData, _aux._p, _aux._h, __omcQ_24fDER_5Faux_2Ep, __omcQ_24fDER_5Faux_2Eh);
    ^~~~~~~~~~~~~~~~~~~~~~~
    __omcQ_24fDER_5Faux
ModelicaTest_trunk_ModelicaTest.Fluid.TestComponents.Valves.TestValveIncompressible_functions.c:13:42: note: '__omcQ_24fDER_5Faux' declared here
  Modelica_Media_Common_IF97BaseTwoPhase __omcQ_24fDER_5Faux;
                                         ^
ModelicaTest_trunk_ModelicaTest.Fluid.TestComponents.Valves.TestValveIncompressible_functions.c:237:31: warning: implicit declaration of function 'omc__omcQ_24fDER0_Modelica_Media_Water_IF97__Utilities_BaseIF97_Basic_tph1' is invalid in C99 [-Wimplicit-function-declaration]
    __omcQ_24fDER_5Faux_2ET = omc__omcQ_24fDER0_Modelica_Media_Water_IF97__Utilities_BaseIF97_Basic_tph1(threadData, _aux._p, _aux._h, __omcQ_24fDER_5Faux_2Ep, __omcQ_24fDER_5Faux_2Eh);
                              ^
ModelicaTest_trunk_ModelicaTest.Fluid.TestComponents.Valves.TestValveIncompressible_functions.c:237:136: error: use of undeclared identifier '__omcQ_24fDER_5Faux_2Ep'
    __omcQ_24fDER_5Faux_2ET = omc__omcQ_24fDER0_Modelica_Media_Water_IF97__Utilities_BaseIF97_Basic_tph1(threadData, _aux._p, _aux._h, __omcQ_24fDER_5Faux_2Ep, __omcQ_24fDER_5Faux_2Eh);
                                                                                                                                       ^
ModelicaTest_trunk_ModelicaTest.Fluid.TestComponents.Valves.TestValveIncompressible_functions.c:237:161: error: use of undeclared identifier '__omcQ_24fDER_5Faux_2Eh'
    __omcQ_24fDER_5Faux_2ET = omc__omcQ_24fDER0_Modelica_Media_Water_IF97__Utilities_BaseIF97_Basic_tph1(threadData, _aux._p, _aux._h, __omcQ_24fDER_5Faux_2Ep, __omcQ_24fDER_5Faux_2Eh);
                                                                                                                                                                ^
ModelicaTest_trunk_ModelicaTest.Fluid.TestComponents.Valves.TestValveIncompressible_functions.c:244:5: error: use of undeclared identifier '__omcQ_24fDER_5Faux_2Es'; did you mean '__omcQ_24fDER_5Faux'?
    __omcQ_24fDER_5Faux_2Es = (_aux._R_s) * ((_g._tau) * (__omcQ_24fDER_5Fg_2Egtau) + (__omcQ_24fDER_5Fg_2Etau) * (_g._gtau) - __omcQ_24fDER_5Fg_2Eg) + (__omcQ_24fDER_5Faux_2ER_5Fs) * ((_g._tau) * (_g._gtau) - _g._g);
    ^~~~~~~~~~~~~~~~~~~~~~~
    __omcQ_24fDER_5Faux
ModelicaTest_trunk_ModelicaTest.Fluid.TestComponents.Valves.TestValveIncompressible_functions.c:13:42: note: '__omcQ_24fDER_5Faux' declared here
  Modelica_Media_Common_IF97BaseTwoPhase __omcQ_24fDER_5Faux;
                                         ^
ModelicaTest_trunk_ModelicaTest.Fluid.TestComponents.Valves.TestValveIncompressible_functions.c:244:59: error: use of undeclared identifier '__omcQ_24fDER_5Fg_2Egtau'
    __omcQ_24fDER_5Faux_2Es = (_aux._R_s) * ((_g._tau) * (__omcQ_24fDER_5Fg_2Egtau) + (__omcQ_24fDER_5Fg_2Etau) * (_g._gtau) - __omcQ_24fDER_5Fg_2Eg) + (__omcQ_24fDER_5Faux_2ER_5Fs) * ((_g._tau) * (_g._gtau) - _g._g);
                                                          ^
ModelicaTest_trunk_ModelicaTest.Fluid.TestComponents.Valves.TestValveIncompressible_functions.c:244:88: error: use of undeclared identifier '__omcQ_24fDER_5Fg_2Etau'
    __omcQ_24fDER_5Faux_2Es = (_aux._R_s) * ((_g._tau) * (__omcQ_24fDER_5Fg_2Egtau) + (__omcQ_24fDER_5Fg_2Etau) * (_g._gtau) - __omcQ_24fDER_5Fg_2Eg) + (__omcQ_24fDER_5Faux_2ER_5Fs) * ((_g._tau) * (_g._gtau) - _g._g);
                                                                                       ^
ModelicaTest_trunk_ModelicaTest.Fluid.TestComponents.Valves.TestValveIncompressible_functions.c:244:128: error: use of undeclared identifier '__omcQ_24fDER_5Fg_2Eg'
    __omcQ_24fDER_5Faux_2Es = (_aux._R_s) * ((_g._tau) * (__omcQ_24fDER_5Fg_2Egtau) + (__omcQ_24fDER_5Fg_2Etau) * (_g._gtau) - __omcQ_24fDER_5Fg_2Eg) + (__omcQ_24fDER_5Faux_2ER_5Fs) * ((_g._tau) * (_g._gtau) - _g._g);
                                                                                                                               ^
ModelicaTest_trunk_ModelicaTest.Fluid.TestComponents.Valves.TestValveIncompressible_functions.c:244:154: error: use of undeclared identifier '__omcQ_24fDER_5Faux_2ER_5Fs'; did you mean '__omcQ_24fDER_5Faux'?
    __omcQ_24fDER_5Faux_2Es = (_aux._R_s) * ((_g._tau) * (__omcQ_24fDER_5Fg_2Egtau) + (__omcQ_24fDER_5Fg_2Etau) * (_g._gtau) - __omcQ_24fDER_5Fg_2Eg) + (__omcQ_24fDER_5Faux_2ER_5Fs) * ((_g._tau) * (_g._gtau) - _g._g);
                                                                                                                                                         ^~~~~~~~~~~~~~~~~~~~~~~~~~~
                                                                                                                                                         __omcQ_24fDER_5Faux
ModelicaTest_trunk_ModelicaTest.Fluid.TestComponents.Valves.TestValveIncompressible_functions.c:13:42: note: '__omcQ_24fDER_5Faux' declared here
  Modelica_Media_Common_IF97BaseTwoPhase __omcQ_24fDER_5Faux;
                                         ^
ModelicaTest_trunk_ModelicaTest.Fluid.TestComponents.Valves.TestValveIncompressible_functions.c:244:183: error: invalid operands to binary expression ('Modelica_Media_Common_IF97BaseTwoPhase' and 'double')
    __omcQ_24fDER_5Faux_2Es = (_aux._R_s) * ((_g._tau) * (__omcQ_24fDER_5Fg_2Egtau) + (__omcQ_24fDER_5Fg_2Etau) * (_g._gtau) - __omcQ_24fDER_5Fg_2Eg) + (__omcQ_24fDER_5Faux_2ER_5Fs) * ((_g._tau) * (_g._gtau) - _g._g);
                                                                                                                                                        ~~~~~~~~~~~~~~~~~~~~~~~~~~~~~ ^ ~~~~~~~~~~~~~~~~~~~~~~~~~~~~~~~~
fatal error: too many errors emitted, stopping now [-ferror-limit=]
1 warning and 20 errors generated.
make: *** [<builtin>: ModelicaTest_trunk_ModelicaTest.Fluid.TestComponents.Valves.TestValveIncompressible_functions.o] Error 1
[Calling os._exit(0), Time elapsed: 3.534510330297053]
Failed to read output from testmodel.py, exit status != 0:
['time', 'SourceP1.ports[1].m_flow', 'SourceP1.ports[1].p', 'SourceP1.ports[1].h_outflow', 'V1.port_b.m_flow', 'V1.port_b.p', 'V1.port_b.h_outflow', 'V1.minLimiter.y', 'SinkP1.ports[1].m_flow', 'SinkP1.ports[1].p', 'SinkP1.ports[1].h_outflow', 'Opening.y', 'SourceP2.ports[1].m_flow', 'SourceP2.ports[1].p', 'SourceP2.ports[1].h_outflow', 'V2.port_b.m_flow', 'V2.port_b.p', 'V2.port_b.h_outflow', 'V2.minLimiter.y', 'SinkP2.ports[1].m_flow', 'SinkP2.ports[1].p', 'SinkP2.ports[1].h_outflow', 'SourceP3.ports[1].m_flow', 'SourceP3.ports[1].p', 'SourceP3.ports[1].h_outflow', 'V3.port_b.m_flow', 'V3.port_b.p', 'V3.port_b.h_outflow', 'V3.minLimiter.y', 'SinkP3.ports[1].m_flow', 'SinkP3.ports[1].p', 'SinkP3.ports[1].h_outflow']
0.6969233527779579 0.706567002 0.38390283900000005
Calling exit ...
<OMPython.OMCSessionZMQ object at 0x7f748ea3d780>