Running: ./testmodel.py --libraries=/home/hudson/saved_omc/libraries/.openmodelica/libraries --ompython_omhome=/usr Buildings_latest_Buildings.DHC.Loads.BaseClasses.Examples.CouplingSpawnZ6.conf.json
loadFile("/home/hudson/saved_omc/libraries/.openmodelica/libraries/ModelicaServices 4.0.0+maint.om/package.mo", uses=false) [Timeout 180]
"Notification: Performance of loadFile(/home/hudson/saved_omc/libraries/.openmodelica/libraries/ModelicaServices 4.0.0+maint.om/package.mo): time 0.001738/0.001738, allocations: 109.9 kB / 19.59 MB, free: 2.328 MB / 14.72 MB
"
[Timeout remaining time 180]
loadFile("/home/hudson/saved_omc/libraries/.openmodelica/libraries/Complex 4.0.0+maint.om/package.mo", uses=false) [Timeout 180]
"Notification: Performance of loadFile(/home/hudson/saved_omc/libraries/.openmodelica/libraries/Complex 4.0.0+maint.om/package.mo): time 0.002204/0.002204, allocations: 193.1 kB / 22.85 MB, free: 5.648 MB / 14.72 MB
"
[Timeout remaining time 180]
loadFile("/home/hudson/saved_omc/libraries/.openmodelica/libraries/Modelica 4.0.0+maint.om/package.mo", uses=false) [Timeout 180]
"Notification: Performance of loadFile(/home/hudson/saved_omc/libraries/.openmodelica/libraries/Modelica 4.0.0+maint.om/package.mo): time 1.458/1.458, allocations: 225.6 MB / 251.5 MB, free: 13.02 MB / 206.1 MB
"
[Timeout remaining time 178]
loadFile("/home/hudson/saved_omc/libraries/.openmodelica/libraries/Buildings 12.0.1-master/package.mo", uses=false) [Timeout 180]
"Notification: Performance of loadFile(/home/hudson/saved_omc/libraries/.openmodelica/libraries/Buildings 12.0.1-master/package.mo): time 3.168/3.168, allocations: 495.5 MB / 0.7835 GB, free: 33.5 MB / 0.6231 GB
"
[Timeout remaining time 176]
Using package Buildings with version 12.0.1 (/home/hudson/saved_omc/libraries/.openmodelica/libraries/Buildings 12.0.1-master/package.mo)
Using package Modelica with version 4.0.0 (/home/hudson/saved_omc/libraries/.openmodelica/libraries/Modelica 4.0.0+maint.om/package.mo)
Using package Complex with version 4.0.0 (/home/hudson/saved_omc/libraries/.openmodelica/libraries/Complex 4.0.0+maint.om/package.mo)
Using package ModelicaServices with version 4.0.0 (/home/hudson/saved_omc/libraries/.openmodelica/libraries/ModelicaServices 4.0.0+maint.om/package.mo)
Running command: translateModel(Buildings.DHC.Loads.BaseClasses.Examples.CouplingSpawnZ6,tolerance=1e-06,outputFormat="mat",numberOfIntervals=2513,variableFilter="time|bui.maxTSet.1..y|bui.minTSet.1..y|bui.znAttic.TAir|bui.znCore_ZN.TAir|bui.znPerimeter_ZN_1.TAir|bui.znPerimeter_ZN_2.TAir|bui.znPerimeter_ZN_3.TAir|bui.znPerimeter_ZN_4.TAir|bui.terUni.1..QActHea_flow|bui.terUni.2..QActHea_flow|bui.terUni.3..QActHea_flow|bui.terUni.4..QActHea_flow|bui.terUni.5..QActHea_flow|bui.terUni.1..QActCoo_flow|bui.terUni.2..QActCoo_flow|bui.terUni.3..QActCoo_flow|bui.terUni.4..QActCoo_flow|bui.terUni.5..QActCoo_flow|supHeaWat.T_in|bui.terUni.1..T_aHeaWat_nominal|bui.terUni.2..T_aHeaWat_nominal|bui.terUni.3..T_aHeaWat_nominal|bui.terUni.4..T_aHeaWat_nominal|bui.terUni.5..T_aHeaWat_nominal|bui.disFloHea.mAct_flow.1..y|bui.disFloHea.mAct_flow.2..y|bui.disFloHea.mAct_flow.3..y|bui.disFloHea.mAct_flow.4..y|bui.disFloHea.mAct_flow.5..y|supChiWat.T_in|bui.terUni.1..T_aChiWat_nominal|bui.terUni.2..T_aChiWat_nominal|bui.terUni.3..T_aChiWat_nominal|bui.terUni.4..T_aChiWat_nominal|bui.terUni.5..T_aChiWat_nominal|bui.disFloCoo.mAct_flow.1..y|bui.disFloCoo.mAct_flow.2..y|bui.disFloCoo.mAct_flow.3..y|bui.disFloCoo.mAct_flow.4..y|bui.disFloCoo.mAct_flow.5..y",fileNamePrefix="Buildings_latest_Buildings.DHC.Loads.BaseClasses.Examples.CouplingSpawnZ6")
translateModel(Buildings.DHC.Loads.BaseClasses.Examples.CouplingSpawnZ6,tolerance=1e-06,outputFormat="mat",numberOfIntervals=2513,variableFilter="time|bui.maxTSet.1..y|bui.minTSet.1..y|bui.znAttic.TAir|bui.znCore_ZN.TAir|bui.znPerimeter_ZN_1.TAir|bui.znPerimeter_ZN_2.TAir|bui.znPerimeter_ZN_3.TAir|bui.znPerimeter_ZN_4.TAir|bui.terUni.1..QActHea_flow|bui.terUni.2..QActHea_flow|bui.terUni.3..QActHea_flow|bui.terUni.4..QActHea_flow|bui.terUni.5..QActHea_flow|bui.terUni.1..QActCoo_flow|bui.terUni.2..QActCoo_flow|bui.terUni.3..QActCoo_flow|bui.terUni.4..QActCoo_flow|bui.terUni.5..QActCoo_flow|supHeaWat.T_in|bui.terUni.1..T_aHeaWat_nominal|bui.terUni.2..T_aHeaWat_nominal|bui.terUni.3..T_aHeaWat_nominal|bui.terUni.4..T_aHeaWat_nominal|bui.terUni.5..T_aHeaWat_nominal|bui.disFloHea.mAct_flow.1..y|bui.disFloHea.mAct_flow.2..y|bui.disFloHea.mAct_flow.3..y|bui.disFloHea.mAct_flow.4..y|bui.disFloHea.mAct_flow.5..y|supChiWat.T_in|bui.terUni.1..T_aChiWat_nominal|bui.terUni.2..T_aChiWat_nominal|bui.terUni.3..T_aChiWat_nominal|bui.terUni.4..T_aChiWat_nominal|bui.terUni.5..T_aChiWat_nominal|bui.disFloCoo.mAct_flow.1..y|bui.disFloCoo.mAct_flow.2..y|bui.disFloCoo.mAct_flow.3..y|bui.disFloCoo.mAct_flow.4..y|bui.disFloCoo.mAct_flow.5..y",fileNamePrefix="Buildings_latest_Buildings.DHC.Loads.BaseClasses.Examples.CouplingSpawnZ6") [Timeout 300]
"Notification: Performance of FrontEnd - loaded program: time 0.001978/0.001978, allocations: 64.45 kB / 1.138 GB, free: 33.85 MB / 0.9044 GB
Notification: Performance of FrontEnd - Absyn->SCode: time 0.3791/0.3811, allocations: 173.6 MB / 1.307 GB, free: 1.965 MB / 0.9981 GB
Notification: Performance of NFInst.instantiate(Buildings.DHC.Loads.BaseClasses.Examples.CouplingSpawnZ6): time 1.773/2.154, allocations: 0.7402 GB / 2.047 GB, free: 4.57 MB / 1.529 GB
Notification: Performance of NFInst.instExpressions: time 0.2383/2.392, allocations: 149.1 MB / 2.193 GB, free: 15.14 MB / 1.686 GB
Notification: Performance of NFInst.updateImplicitVariability: time 0.03637/2.428, allocations: 0.8682 MB / 2.194 GB, free: 14.27 MB / 1.686 GB
Notification: Performance of NFTyping.typeComponents: time 0.02679/2.455, allocations: 7.935 MB / 2.202 GB, free: 6.289 MB / 1.686 GB
Notification: Performance of NFTyping.typeBindings: time 0.06629/2.521, allocations: 21.14 MB / 2.222 GB, free: 1.066 MB / 1.701 GB
Notification: Performance of NFTyping.typeClassSections: time 0.03943/2.561, allocations: 14.1 MB / 2.236 GB, free: 3.023 MB / 1.717 GB
Notification: Performance of NFFlatten.flatten: time 2.238/4.799, allocations: 114.8 MB / 2.348 GB, free: 67.15 MB / 1.748 GB
Notification: Performance of NFFlatten.resolveConnections: time 0.07414/4.873, allocations: 30.72 MB / 2.378 GB, free: 65.25 MB / 1.748 GB
Notification: Performance of NFEvalConstants.evaluate: time 0.08472/4.958, allocations: 35.45 MB / 2.413 GB, free: 63.1 MB / 1.748 GB
Notification: Performance of NFSimplifyModel.simplify: time 0.05514/5.013, allocations: 26.56 MB / 2.439 GB, free: 58.86 MB / 1.748 GB
Notification: Performance of NFPackage.collectConstants: time 0.01914/5.032, allocations: 5.434 MB / 2.444 GB, free: 58.86 MB / 1.748 GB
Notification: Performance of NFFlatten.collectFunctions: time 0.05101/5.083, allocations: 15.8 MB / 2.459 GB, free: 58.85 MB / 1.748 GB
Notification: Performance of NFScalarize.scalarize: time 0.02747/5.111, allocations: 13.47 MB / 2.473 GB, free: 57.23 MB / 1.748 GB
Notification: Performance of NFVerifyModel.verify: time 0.05819/5.169, allocations: 23.83 MB / 2.496 GB, free: 51.65 MB / 1.748 GB
Notification: Performance of NFConvertDAE.convert: time 0.1174/5.287, allocations: 80.57 MB / 2.574 GB, free: 7.16 MB / 1.764 GB
Notification: Performance of FrontEnd - DAE generated: time 6.953e-06/5.287, allocations: 0 / 2.574 GB, free: 7.16 MB / 1.764 GB
Notification: Performance of FrontEnd: time 2.104e-06/5.287, allocations: 2.906 kB / 2.574 GB, free: 7.16 MB / 1.764 GB
Notification: Performance of Transformations before backend: time 0.002292/5.289, allocations: 0 / 2.574 GB, free: 7.16 MB / 1.764 GB
Notification: Model statistics after passing the front-end and creating the data structures used by the back-end:
 * Number of equations: 5803
 * Number of variables: 5803
Notification: Performance of Generate backend data structure: time 0.2021/5.491, allocations: 67.38 MB / 2.64 GB, free: 3.953 MB / 1.826 GB
Notification: Performance of prepare preOptimizeDAE: time 5.043e-05/5.491, allocations: 12.03 kB / 2.64 GB, free: 3.941 MB / 1.826 GB
Notification: Performance of preOpt normalInlineFunction (simulation): time 0.1424/5.633, allocations: 24.72 MB / 2.664 GB, free: 11.21 MB / 1.858 GB
Notification: Performance of preOpt evaluateParameters (simulation): time 0.1277/5.761, allocations: 51.7 MB / 2.715 GB, free: 8.691 MB / 1.904 GB
Notification: Performance of preOpt simplifyIfEquations (simulation): time 0.003845/5.765, allocations: 2.207 MB / 2.717 GB, free: 6.422 MB / 1.904 GB
Notification: Performance of preOpt expandDerOperator (simulation): time 0.01384/5.779, allocations: 2.393 MB / 2.719 GB, free: 4.039 MB / 1.904 GB
Notification: Performance of preOpt clockPartitioning (simulation): time 0.1461/5.925, allocations: 45.51 MB / 2.764 GB, free: 5.906 MB / 1.951 GB
Notification: Performance of preOpt findStateOrder (simulation): time 0.001079/5.926, allocations: 38.66 kB / 2.764 GB, free: 5.887 MB / 1.951 GB
Notification: Performance of preOpt replaceEdgeChange (simulation): time 0.01129/5.937, allocations: 0.9271 MB / 2.765 GB, free: 4.969 MB / 1.951 GB
Notification: Performance of preOpt inlineArrayEqn (simulation): time 0.0009733/5.938, allocations: 0.853 MB / 2.766 GB, free: 4.113 MB / 1.951 GB
Notification: Performance of preOpt removeEqualRHS (simulation): time 0.1531/6.091, allocations: 51.44 MB / 2.816 GB, free: 0.8086 MB / 1.998 GB
Warning: The model contains alias variables with redundant start and/or conflicting nominal values. It is recommended to resolve the conflicts, because otherwise the system could be hard to solve. To print the conflicting alias sets and the chosen candidates please use -d=aliasConflicts.
Notification: Performance of preOpt removeSimpleEquations (simulation): time 0.3948/6.486, allocations: 178.3 MB / 2.99 GB, free: 10.53 MB / 2.186 GB
Notification: Performance of preOpt comSubExp (simulation): time 0.09802/6.584, allocations: 36.36 MB / 3.026 GB, free: 6.711 MB / 2.217 GB
Notification: Performance of preOpt resolveLoops (simulation): time 0.05422/6.638, allocations: 19.56 MB / 3.045 GB, free: 3.125 MB / 2.233 GB
Notification: Performance of preOpt evalFunc (simulation): time 1.089/7.728, allocations: 56.5 MB / 3.1 GB, free: 1.058 GB / 2.233 GB
Notification: Performance of preOpt encapsulateWhenConditions (simulation): time 0.05625/7.784, allocations: 21.26 MB / 3.121 GB, free: 1.052 GB / 2.233 GB
Notification: Performance of pre-optimization done (n=1432): time 2.964e-05/7.784, allocations: 0 / 3.121 GB, free: 1.052 GB / 2.233 GB
Notification: Performance of matching and sorting (n=1432): time 0.4474/8.232, allocations: 118.6 MB / 3.236 GB, free: 0.9854 GB / 2.233 GB
Notification: Performance of inlineWhenForInitialization (initialization): time 0.0004853/8.232, allocations: 0.935 MB / 3.237 GB, free: 0.9843 GB / 2.233 GB
Notification: Performance of selectInitializationVariablesDAE (initialization): time 0.08411/8.316, allocations: 33.39 MB / 3.27 GB, free: 0.9524 GB / 2.233 GB
Notification: Performance of collectPreVariables (initialization): time 0.006126/8.322, allocations: 446 kB / 3.27 GB, free: 0.9519 GB / 2.233 GB
Notification: Performance of collectInitialEqns (initialization): time 0.02132/8.344, allocations: 14.97 MB / 3.285 GB, free: 0.9398 GB / 2.233 GB
Notification: Performance of collectInitialBindings (initialization): time 0.009261/8.353, allocations: 5.133 MB / 3.29 GB, free: 0.935 GB / 2.233 GB
Notification: Performance of simplifyInitialFunctions (initialization): time 0.02776/8.381, allocations: 5.697 MB / 3.296 GB, free: 0.9294 GB / 2.233 GB
Notification: Performance of setup shared object (initialization): time 5.11e-05/8.381, allocations: 305.1 kB / 3.296 GB, free: 0.9291 GB / 2.233 GB
Notification: Performance of preBalanceInitialSystem (initialization): time 0.05343/8.434, allocations: 23.02 MB / 3.318 GB, free: 0.9066 GB / 2.233 GB
Notification: Performance of partitionIndependentBlocks (initialization): time 0.0598/8.494, allocations: 29.11 MB / 3.347 GB, free: 0.876 GB / 2.233 GB
Notification: Performance of analyzeInitialSystem (initialization): time 0.103/8.597, allocations: 46.98 MB / 3.393 GB, free: 0.8283 GB / 2.233 GB
Notification: Performance of solveInitialSystemEqSystem (initialization): time 0.0002114/8.597, allocations: 38.91 kB / 3.393 GB, free: 0.8283 GB / 2.233 GB
Notification: Performance of matching and sorting (n=3083) (initialization): time 0.2176/8.815, allocations: 73.09 MB / 3.464 GB, free: 0.7567 GB / 2.233 GB
Notification: Performance of prepare postOptimizeDAE: time 0.0001339/8.815, allocations: 85.7 kB / 3.464 GB, free: 0.7566 GB / 2.233 GB
Notification: Performance of postOpt simplifyComplexFunction (initialization): time 0.0002167/8.815, allocations: 124 kB / 3.464 GB, free: 0.7565 GB / 2.233 GB
Notification: Performance of postOpt tearingSystem (initialization): time 0.05294/8.868, allocations: 22.79 MB / 3.487 GB, free: 0.7345 GB / 2.233 GB
Notification: Performance of postOpt solveSimpleEquations (initialization): time 0.03112/8.899, allocations: 6.256 MB / 3.493 GB, free: 0.7283 GB / 2.233 GB
Notification: Performance of postOpt calculateStrongComponentJacobians (initialization): time 0.08183/8.981, allocations: 53.56 MB / 3.545 GB, free: 0.6745 GB / 2.233 GB
Notification: Performance of postOpt simplifyAllExpressions (initialization): time 0.04464/9.026, allocations: 5.728 MB / 3.551 GB, free: 0.6689 GB / 2.233 GB
Notification: Performance of postOpt collapseArrayExpressions (initialization): time 0.007626/9.033, allocations: 1.111 MB / 3.552 GB, free: 0.6678 GB / 2.233 GB
Notification: Performance of preBalanceInitialSystem (initialization_lambda0): time 0.07412/9.107, allocations: 34.64 MB / 3.585 GB, free: 0.634 GB / 2.233 GB
Notification: Performance of partitionIndependentBlocks (initialization_lambda0): time 0.05739/9.165, allocations: 28.45 MB / 3.613 GB, free: 0.604 GB / 2.233 GB
Notification: Performance of analyzeInitialSystem (initialization_lambda0): time 0.1009/9.266, allocations: 45.84 MB / 3.658 GB, free: 0.5574 GB / 2.233 GB
Notification: Performance of solveInitialSystemEqSystem (initialization_lambda0): time 0.0002319/9.266, allocations: 36.23 kB / 3.658 GB, free: 0.5574 GB / 2.233 GB
Notification: Performance of matching and sorting (n=3083) (initialization_lambda0): time 0.2222/9.488, allocations: 73 MB / 3.729 GB, free: 497.6 MB / 2.233 GB
Notification: Performance of prepare postOptimizeDAE: time 0.0001316/9.488, allocations: 89.64 kB / 3.729 GB, free: 497.5 MB / 2.233 GB
Notification: Performance of postOpt simplifyComplexFunction (initialization): time 0.0001932/9.488, allocations: 128 kB / 3.73 GB, free: 497.4 MB / 2.233 GB
Notification: Performance of postOpt tearingSystem (initialization): time 0.05354/9.542, allocations: 22.8 MB / 3.752 GB, free: 474.5 MB / 2.233 GB
Notification: Performance of postOpt solveSimpleEquations (initialization): time 0.03065/9.572, allocations: 6.118 MB / 3.758 GB, free: 468.4 MB / 2.233 GB
Notification: Performance of postOpt calculateStrongComponentJacobians (initialization): time 0.08189/9.654, allocations: 52.12 MB / 3.809 GB, free: 414.7 MB / 2.233 GB
Notification: Performance of postOpt simplifyAllExpressions (initialization): time 0.04289/9.697, allocations: 5.199 MB / 3.814 GB, free: 409.5 MB / 2.233 GB
Notification: Performance of postOpt collapseArrayExpressions (initialization): time 0.007026/9.704, allocations: 1.087 MB / 3.815 GB, free: 408.5 MB / 2.233 GB
Notification: Model statistics after passing the back-end for initialization:
 * Number of independent subsystems: 573
 * Number of states: 0 ()
 * Number of discrete variables: 294 (bui.znAttic.fmuZon.dtLast,$PRE.bui.znAttic.fmuZon.dtLast,bui.znAttic.fmuZon.tLast,$PRE.bui.znAttic.fmuZon.tLast,bui.znAttic.fmuZon.EGaiRadLast,$PRE.bui.znAttic.fmuZon.EGaiRadLast,bui.znPerimeter_ZN_4.fmuZon.dtLast,$PRE.bui.znPerimeter_ZN_4.fmuZon.dtLast,bui.znPerimeter_ZN_4.fmuZon.tLast,$PRE.bui.znPerimeter_ZN_4.fmuZon.tLast,bui.znPerimeter_ZN_4.fmuZon.EGaiRadLast,$PRE.bui.znPerimeter_ZN_4.fmuZon.EGaiRadLast,bui.znPerimeter_ZN_3.fmuZon.dtLast,$PRE.bui.znPerimeter_ZN_3.fmuZon.dtLast,bui.znPerimeter_ZN_3.fmuZon.tLast,$PRE.bui.znPerimeter_ZN_3.fmuZon.tLast,bui.znPerimeter_ZN_3.fmuZon.EGaiRadLast,$PRE.bui.znPerimeter_ZN_3.fmuZon.EGaiRadLast,bui.znPerimeter_ZN_2.fmuZon.dtLast,$PRE.bui.znPerimeter_ZN_2.fmuZon.dtLast,bui.znPerimeter_ZN_2.fmuZon.tLast,$PRE.bui.znPerimeter_ZN_2.fmuZon.tLast,bui.znPerimeter_ZN_2.fmuZon.EGaiRadLast,$PRE.bui.znPerimeter_ZN_2.fmuZon.EGaiRadLast,bui.znPerimeter_ZN_1.fmuZon.dtLast,$PRE.bui.znPerimeter_ZN_1.fmuZon.dtLast,bui.znPerimeter_ZN_1.fmuZon.tLast,$PRE.bui.znPerimeter_ZN_1.fmuZon.tLast,bui.znPerimeter_ZN_1.fmuZon.EGaiRadLast,$PRE.bui.znPerimeter_ZN_1.fmuZon.EGaiRadLast,bui.znCore_ZN.fmuZon.dtLast,$PRE.bui.znCore_ZN.fmuZon.dtLast,bui.znCore_ZN.fmuZon.tLast,$PRE.bui.znCore_ZN.fmuZon.tLast,bui.znCore_ZN.fmuZon.EGaiRadLast,$PRE.bui.znCore_ZN.fmuZon.EGaiRadLast,bui.building.weaDat.conTim.canRepeatWeatherFile,bui.building.weaDat.conTimMin.canRepeatWeatherFile,bui.building.weaDat.decAng.tNext,$PRE.bui.building.weaDat.decAng.tNext,bui.building.weaDat.eqnTim.tNext,$PRE.bui.building.weaDat.eqnTim.tNext,bui.building.weaDat.conTim.tNext,$PRE.bui.building.weaDat.conTim.tNext,bui.building.weaDat.conTimMin.tNext,$PRE.bui.building.weaDat.conTimMin.tNext,bui.building.weaDat.locTim.tNext,$PRE.bui.building.weaDat.locTim.tNext,$whenCondition7,$whenCondition8,$whenCondition9,$whenCondition10,$whenCondition11,bui.terUni[5].conCoo.con1.y,bui.terUni[5].conHea.con1.y,bui.terUni[4].conCoo.con1.y,bui.terUni[4].conHea.con1.y,bui.terUni[3].conCoo.con1.y,bui.terUni[3].conHea.con1.y,bui.terUni[2].conCoo.con1.y,bui.terUni[2].conHea.con1.y,bui.terUni[1].conCoo.con1.y,bui.terUni[1].conHea.con1.y,bui.terUni[1].hexHea.flowRegime_nominal,bui.terUni[1].hexHea.flowRegime,bui.terUni[2].hexHea.flowRegime_nominal,bui.terUni[2].hexHea.flowRegime,bui.terUni[3].hexHea.flowRegime_nominal,bui.terUni[3].hexHea.flowRegime,bui.terUni[4].hexHea.flowRegime_nominal,bui.terUni[4].hexHea.flowRegime,bui.terUni[5].hexHea.flowRegime_nominal,bui.terUni[5].hexHea.flowRegime,bui.terUni[1].hexWetNtu.flowRegime_nominal,bui.terUni[1].hexWetNtu.dryWetCalcs.fullyDry.cfg,bui.terUni[1].hexWetNtu.dryWetCalcs.fullyWet.cfg,bui.terUni[1].hexWetNtu.dryWetCalcs.cfg,bui.terUni[1].hexWetNtu.flowRegime,bui.terUni[2].hexWetNtu.flowRegime_nominal,bui.terUni[2].hexWetNtu.dryWetCalcs.fullyDry.cfg,bui.terUni[2].hexWetNtu.dryWetCalcs.fullyWet.cfg,bui.terUni[2].hexWetNtu.dryWetCalcs.cfg,bui.terUni[2].hexWetNtu.flowRegime,bui.terUni[3].hexWetNtu.flowRegime_nominal,bui.terUni[3].hexWetNtu.dryWetCalcs.fullyDry.cfg,bui.terUni[3].hexWetNtu.dryWetCalcs.fullyWet.cfg,bui.terUni[3].hexWetNtu.dryWetCalcs.cfg,bui.terUni[3].hexWetNtu.flowRegime,bui.terUni[4].hexWetNtu.flowRegime_nominal,bui.terUni[4].hexWetNtu.dryWetCalcs.fullyDry.cfg,bui.terUni[4].hexWetNtu.dryWetCalcs.fullyWet.cfg,bui.terUni[4].hexWetNtu.dryWetCalcs.cfg,bui.terUni[4].hexWetNtu.flowRegime,bui.terUni[5].hexWetNtu.flowRegime_nominal,bui.terUni[5].hexWetNtu.dryWetCalcs.fullyDry.cfg,bui.terUni[5].hexWetNtu.dryWetCalcs.fullyWet.cfg,bui.terUni[5].hexWetNtu.dryWetCalcs.cfg,bui.terUni[5].hexWetNtu.flowRegime,bui.terUni[5].hexWetNtu.UAFroRated.isFulWet,bui.terUni[5].hexWetNtu.UAFroRated.isFulDry,bui.terUni[4].hexWetNtu.UAFroRated.isFulWet,bui.terUni[4].hexWetNtu.UAFroRated.isFulDry,bui.terUni[3].hexWetNtu.UAFroRated.isFulWet,bui.terUni[3].hexWetNtu.UAFroRated.isFulDry,bui.terUni[2].hexWetNtu.UAFroRated.isFulWet,bui.terUni[2].hexWetNtu.UAFroRated.isFulDry,bui.terUni[1].hexWetNtu.UAFroRated.isFulWet,bui.terUni[1].hexWetNtu.UAFroRated.isFulDry,bui.znPerimeter_ZN_4.vol.computeCSen,bui.znPerimeter_ZN_4.fmuZon.nObj,bui.znPerimeter_ZN_3.vol.computeCSen,bui.znPerimeter_ZN_3.fmuZon.nObj,bui.znPerimeter_ZN_2.vol.computeCSen,bui.znPerimeter_ZN_2.fmuZon.nObj,bui.znPerimeter_ZN_1.vol.computeCSen,bui.znPerimeter_ZN_1.fmuZon.nObj,bui.znCore_ZN.vol.computeCSen,bui.znCore_ZN.fmuZon.nObj,bui.znAttic.vol.computeCSen,bui.znAttic.fmuZon.nObj,bui.znAttic.fmuZon.QConLast_flow,$PRE.bui.znAttic.fmuZon.QConLast_flow,bui.znAttic.fmuZon.QGaiRadAve_flow,$PRE.bui.znAttic.fmuZon.QGaiRadAve_flow,bui.znAttic.fmuZon.TRooLast,$PRE.bui.znAttic.fmuZon.TRooLast,bui.znAttic.fmuZon.TAveInlet,$PRE.bui.znAttic.fmuZon.TAveInlet,bui.znAttic.fmuZon.mInlet_flow,$PRE.bui.znAttic.fmuZon.mInlet_flow,bui.znAttic.fmuZon.tNext,$PRE.bui.znAttic.fmuZon.tNext,bui.znAttic.fmuZon.yEP[5],$PRE.bui.znAttic.fmuZon.yEP[5],bui.znAttic.fmuZon.yEP[4],$PRE.bui.znAttic.fmuZon.yEP[4],bui.znAttic.fmuZon.yEP[3],$PRE.bui.znAttic.fmuZon.yEP[3],bui.znAttic.fmuZon.yEP[2],$PRE.bui.znAttic.fmuZon.yEP[2],bui.znAttic.fmuZon.yEP[1],$PRE.bui.znAttic.fmuZon.yEP[1],bui.znAttic.fmuZon.QPeo_flow,$PRE.bui.znAttic.fmuZon.QPeo_flow,bui.znAttic.fmuZon.QLat_flow,$PRE.bui.znAttic.fmuZon.QLat_flow,bui.znAttic.fmuZon.TRad,$PRE.bui.znAttic.fmuZon.TRad,$whenCondition1,bui.znPerimeter_ZN_4.fmuZon.QConLast_flow,$PRE.bui.znPerimeter_ZN_4.fmuZon.QConLast_flow,bui.znPerimeter_ZN_4.fmuZon.QGaiRadAve_flow,$PRE.bui.znPerimeter_ZN_4.fmuZon.QGaiRadAve_flow,bui.znPerimeter_ZN_4.fmuZon.TRooLast,$PRE.bui.znPerimeter_ZN_4.fmuZon.TRooLast,bui.znPerimeter_ZN_4.fmuZon.TAveInlet,$PRE.bui.znPerimeter_ZN_4.fmuZon.TAveInlet,bui.znPerimeter_ZN_4.fmuZon.mInlet_flow,$PRE.bui.znPerimeter_ZN_4.fmuZon.mInlet_flow,bui.znPerimeter_ZN_4.fmuZon.tNext,$PRE.bui.znPerimeter_ZN_4.fmuZon.tNext,bui.znPerimeter_ZN_4.fmuZon.yEP[5],$PRE.bui.znPerimeter_ZN_4.fmuZon.yEP[5],bui.znPerimeter_ZN_4.fmuZon.yEP[4],$PRE.bui.znPerimeter_ZN_4.fmuZon.yEP[4],bui.znPerimeter_ZN_4.fmuZon.yEP[3],$PRE.bui.znPerimeter_ZN_4.fmuZon.yEP[3],bui.znPerimeter_ZN_4.fmuZon.yEP[2],$PRE.bui.znPerimeter_ZN_4.fmuZon.yEP[2],bui.znPerimeter_ZN_4.fmuZon.yEP[1],$PRE.bui.znPerimeter_ZN_4.fmuZon.yEP[1],bui.znPerimeter_ZN_4.fmuZon.QPeo_flow,$PRE.bui.znPerimeter_ZN_4.fmuZon.QPeo_flow,bui.znPerimeter_ZN_4.fmuZon.QLat_flow,$PRE.bui.znPerimeter_ZN_4.fmuZon.QLat_flow,bui.znPerimeter_ZN_4.fmuZon.TRad,$PRE.bui.znPerimeter_ZN_4.fmuZon.TRad,bui.znPerimeter_ZN_3.fmuZon.QConLast_flow,$PRE.bui.znPerimeter_ZN_3.fmuZon.QConLast_flow,bui.znPerimeter_ZN_3.fmuZon.QGaiRadAve_flow,$PRE.bui.znPerimeter_ZN_3.fmuZon.QGaiRadAve_flow,bui.znPerimeter_ZN_3.fmuZon.TRooLast,$PRE.bui.znPerimeter_ZN_3.fmuZon.TRooLast,bui.znPerimeter_ZN_3.fmuZon.TAveInlet,$PRE.bui.znPerimeter_ZN_3.fmuZon.TAveInlet,bui.znPerimeter_ZN_3.fmuZon.mInlet_flow,$PRE.bui.znPerimeter_ZN_3.fmuZon.mInlet_flow,bui.znPerimeter_ZN_3.fmuZon.tNext,$PRE.bui.znPerimeter_ZN_3.fmuZon.tNext,bui.znPerimeter_ZN_3.fmuZon.yEP[5],$PRE.bui.znPerimeter_ZN_3.fmuZon.yEP[5],bui.znPerimeter_ZN_3.fmuZon.yEP[4],$PRE.bui.znPerimeter_ZN_3.fmuZon.yEP[4],bui.znPerimeter_ZN_3.fmuZon.yEP[3],$PRE.bui.znPerimeter_ZN_3.fmuZon.yEP[3],bui.znPerimeter_ZN_3.fmuZon.yEP[2],$PRE.bui.znPerimeter_ZN_3.fmuZon.yEP[2],bui.znPerimeter_ZN_3.fmuZon.yEP[1],$PRE.bui.znPerimeter_ZN_3.fmuZon.yEP[1],bui.znPerimeter_ZN_3.fmuZon.QPeo_flow,$PRE.bui.znPerimeter_ZN_3.fmuZon.QPeo_flow,bui.znPerimeter_ZN_3.fmuZon.QLat_flow,$PRE.bui.znPerimeter_ZN_3.fmuZon.QLat_flow,bui.znPerimeter_ZN_3.fmuZon.TRad,$PRE.bui.znPerimeter_ZN_3.fmuZon.TRad,bui.znPerimeter_ZN_2.fmuZon.QConLast_flow,$PRE.bui.znPerimeter_ZN_2.fmuZon.QConLast_flow,bui.znPerimeter_ZN_2.fmuZon.QGaiRadAve_flow,$PRE.bui.znPerimeter_ZN_2.fmuZon.QGaiRadAve_flow,bui.znPerimeter_ZN_2.fmuZon.TRooLast,$PRE.bui.znPerimeter_ZN_2.fmuZon.TRooLast,bui.znPerimeter_ZN_2.fmuZon.TAveInlet,$PRE.bui.znPerimeter_ZN_2.fmuZon.TAveInlet,bui.znPerimeter_ZN_2.fmuZon.mInlet_flow,$PRE.bui.znPerimeter_ZN_2.fmuZon.mInlet_flow,bui.znPerimeter_ZN_2.fmuZon.tNext,$PRE.bui.znPerimeter_ZN_2.fmuZon.tNext,bui.znPerimeter_ZN_2.fmuZon.yEP[5],$PRE.bui.znPerimeter_ZN_2.fmuZon.yEP[5],bui.znPerimeter_ZN_2.fmuZon.yEP[4],$PRE.bui.znPerimeter_ZN_2.fmuZon.yEP[4],bui.znPerimeter_ZN_2.fmuZon.yEP[3],$PRE.bui.znPerimeter_ZN_2.fmuZon.yEP[3],bui.znPerimeter_ZN_2.fmuZon.yEP[2],$PRE.bui.znPerimeter_ZN_2.fmuZon.yEP[2],bui.znPerimeter_ZN_2.fmuZon.yEP[1],$PRE.bui.znPerimeter_ZN_2.fmuZon.yEP[1],bui.znPerimeter_ZN_2.fmuZon.QPeo_flow,$PRE.bui.znPerimeter_ZN_2.fmuZon.QPeo_flow,bui.znPerimeter_ZN_2.fmuZon.QLat_flow,$PRE.bui.znPerimeter_ZN_2.fmuZon.QLat_flow,bui.znPerimeter_ZN_2.fmuZon.TRad,$PRE.bui.znPerimeter_ZN_2.fmuZon.TRad,bui.znPerimeter_ZN_1.fmuZon.QConLast_flow,$PRE.bui.znPerimeter_ZN_1.fmuZon.QConLast_flow,bui.znPerimeter_ZN_1.fmuZon.QGaiRadAve_flow,$PRE.bui.znPerimeter_ZN_1.fmuZon.QGaiRadAve_flow,bui.znPerimeter_ZN_1.fmuZon.TRooLast,$PRE.bui.znPerimeter_ZN_1.fmuZon.TRooLast,bui.znPerimeter_ZN_1.fmuZon.TAveInlet,$PRE.bui.znPerimeter_ZN_1.fmuZon.TAveInlet,bui.znPerimeter_ZN_1.fmuZon.mInlet_flow,$PRE.bui.znPerimeter_ZN_1.fmuZon.mInlet_flow,bui.znPerimeter_ZN_1.fmuZon.tNext,$PRE.bui.znPerimeter_ZN_1.fmuZon.tNext,bui.znPerimeter_ZN_1.fmuZon.yEP[5],$PRE.bui.znPerimeter_ZN_1.fmuZon.yEP[5],bui.znPerimeter_ZN_1.fmuZon.yEP[4],$PRE.bui.znPerimeter_ZN_1.fmuZon.yEP[4],bui.znPerimeter_ZN_1.fmuZon.yEP[3],$PRE.bui.znPerimeter_ZN_1.fmuZon.yEP[3],bui.znPerimeter_ZN_1.fmuZon.yEP[2],$PRE.bui.znPerimeter_ZN_1.fmuZon.yEP[2],bui.znPerimeter_ZN_1.fmuZon.yEP[1],$PRE.bui.znPerimeter_ZN_1.fmuZon.yEP[1],bui.znPerimeter_ZN_1.fmuZon.QPeo_flow,$PRE.bui.znPerimeter_ZN_1.fmuZon.QPeo_flow,bui.znPerimeter_ZN_1.fmuZon.QLat_flow,$PRE.bui.znPerimeter_ZN_1.fmuZon.QLat_flow,bui.znPerimeter_ZN_1.fmuZon.TRad,$PRE.bui.znPerimeter_ZN_1.fmuZon.TRad,bui.znCore_ZN.fmuZon.QConLast_flow,$PRE.bui.znCore_ZN.fmuZon.QConLast_flow,bui.znCore_ZN.fmuZon.QGaiRadAve_flow,$PRE.bui.znCore_ZN.fmuZon.QGaiRadAve_flow,bui.znCore_ZN.fmuZon.TRooLast,$PRE.bui.znCore_ZN.fmuZon.TRooLast,bui.znCore_ZN.fmuZon.TAveInlet,$PRE.bui.znCore_ZN.fmuZon.TAveInlet,bui.znCore_ZN.fmuZon.mInlet_flow,$PRE.bui.znCore_ZN.fmuZon.mInlet_flow,bui.znCore_ZN.fmuZon.tNext,$PRE.bui.znCore_ZN.fmuZon.tNext,bui.znCore_ZN.fmuZon.yEP[5],$PRE.bui.znCore_ZN.fmuZon.yEP[5],bui.znCore_ZN.fmuZon.yEP[4],$PRE.bui.znCore_ZN.fmuZon.yEP[4],bui.znCore_ZN.fmuZon.yEP[3],$PRE.bui.znCore_ZN.fmuZon.yEP[3],bui.znCore_ZN.fmuZon.yEP[2],$PRE.bui.znCore_ZN.fmuZon.yEP[2],bui.znCore_ZN.fmuZon.yEP[1],$PRE.bui.znCore_ZN.fmuZon.yEP[1],bui.znCore_ZN.fmuZon.QPeo_flow,$PRE.bui.znCore_ZN.fmuZon.QPeo_flow,bui.znCore_ZN.fmuZon.QLat_flow,$PRE.bui.znCore_ZN.fmuZon.QLat_flow,bui.znCore_ZN.fmuZon.TRad,$PRE.bui.znCore_ZN.fmuZon.TRad,$whenCondition2,$whenCondition3,$whenCondition4,$whenCondition5,$whenCondition6)
 * Number of discrete states: 0 ()
 * Number of clocked states: 0 ()
 * Top-level inputs: 0
Notification: Strong component statistics for initialization (2502):
 * Single equations (assignments): 2442
 * Array equations: 29
 * Algorithm blocks: 0
 * Record equations: 7
 * When equations: 0
 * If-equations: 0
 * Equation systems (not torn): 7
 * Torn equation systems: 17
 * Mixed (continuous/discrete) equation systems: 0
Notification: Equation system details (not torn):
 * Constant Jacobian (size): 0 systems
 * Linear Jacobian (size,density): 0 systems
 * Non-linear Jacobian (size): 7 systems
   {1, 1, 1, 1, 1, 1, 1}
 * Without analytic Jacobian (size): 0 systems
Notification: Torn system details for strict tearing set:
 * Linear torn systems (#iteration vars, #inner vars, density): 5 systems
   {(1,2,100.0%), (1,2,100.0%), (1,2,100.0%), (1,2,100.0%), (1,2,100.0%)}
 * Non-linear torn systems (#iteration vars, #inner vars): 12 systems
   {(1,2), (1,13), (5,45), (5,45), (5,45), (5,45), (5,45), (5,2), (5,2), (5,2), (5,2), (5,2)}
Notification: Performance of prepare postOptimizeDAE: time 0.01334/9.718, allocations: 1.709 MB / 3.816 GB, free: 406.7 MB / 2.233 GB
Notification: Performance of postOpt lateInlineFunction (simulation): time 0.0145/9.732, allocations: 2.876 MB / 3.819 GB, free: 403.8 MB / 2.233 GB
Notification: Performance of postOpt wrapFunctionCalls (simulation): time 0.2377/9.97, allocations: 65.03 MB / 3.883 GB, free: 338.8 MB / 2.233 GB
Notification: Performance of postOpt inlineArrayEqn (simulation): time 0.0002068/9.97, allocations: 152 kB / 3.883 GB, free: 338.6 MB / 2.233 GB
Notification: Performance of postOpt constantLinearSystem (simulation): time 6.194e-05/9.97, allocations: 7.938 kB / 3.883 GB, free: 338.6 MB / 2.233 GB
Notification: Performance of postOpt simplifysemiLinear (simulation): time 0.2085/10.18, allocations: 57.46 MB / 3.939 GB, free: 281 MB / 2.233 GB
Warning: The model contains alias variables with redundant start and/or conflicting nominal values. It is recommended to resolve the conflicts, because otherwise the system could be hard to solve. To print the conflicting alias sets and the chosen candidates please use -d=aliasConflicts.
Notification: Performance of postOpt removeSimpleEquations (simulation): time 0.2666/10.45, allocations: 98.37 MB / 4.035 GB, free: 182.6 MB / 2.233 GB
Notification: Performance of postOpt simplifyComplexFunction (simulation): time 0.0002006/10.45, allocations: 8.156 kB / 4.035 GB, free: 182.6 MB / 2.233 GB
Notification: Performance of postOpt solveSimpleEquations (simulation): time 0.02239/10.47, allocations: 4.088 MB / 4.039 GB, free: 178.5 MB / 2.233 GB
Notification: Performance of postOpt tearingSystem (simulation): time 0.03532/10.5, allocations: 13.94 MB / 4.053 GB, free: 164.5 MB / 2.233 GB
Notification: Performance of postOpt inputDerivativesUsed (simulation): time 0.005322/10.51, allocations: 471.5 kB / 4.053 GB, free: 164.1 MB / 2.233 GB
Notification: Performance of postOpt calculateStrongComponentJacobians (simulation): time 0.0684/10.58, allocations: 50.09 MB / 4.102 GB, free: 111.8 MB / 2.233 GB
Notification: Performance of postOpt calculateStateSetsJacobians (simulation): time 9.337e-06/10.58, allocations: 11.94 kB / 4.102 GB, free: 111.8 MB / 2.233 GB
Notification: Performance of postOpt symbolicJacobian (simulation): time 0.2221/10.8, allocations: 78.53 MB / 4.179 GB, free: 32.96 MB / 2.233 GB
Notification: Performance of postOpt removeConstants (simulation): time 0.02778/10.83, allocations: 8.371 MB / 4.187 GB, free: 24.54 MB / 2.233 GB
Notification: Performance of postOpt simplifyTimeIndepFuncCalls (simulation): time 0.0134/10.84, allocations: 304 kB / 4.187 GB, free: 24.24 MB / 2.233 GB
Notification: Performance of postOpt simplifyAllExpressions (simulation): time 0.0372/10.88, allocations: 3.62 MB / 4.191 GB, free: 20.62 MB / 2.233 GB
Notification: Performance of postOpt findZeroCrossings (simulation): time 0.004789/10.88, allocations: 0.9465 MB / 4.192 GB, free: 19.67 MB / 2.233 GB
Notification: Performance of postOpt collapseArrayExpressions (simulation): time 0.005473/10.89, allocations: 0.6595 MB / 4.192 GB, free: 19.01 MB / 2.233 GB
Notification: Performance of sorting global known variables: time 0.9952/11.88, allocations: 23.16 MB / 4.215 GB, free: 1.018 GB / 2.233 GB
Notification: Performance of sort global known variables: time 2.2e-07/11.88, allocations: 0 / 4.215 GB, free: 1.018 GB / 2.233 GB
Notification: Performance of remove unused functions: time 0.08328/11.97, allocations: 16.04 MB / 4.231 GB, free: 1.018 GB / 2.233 GB
Notification: Model statistics after passing the back-end for simulation:
 * Number of independent subsystems: 36
 * Number of states: 43 (bui.znCore_ZN.fmuZon.EGaiRad,bui.znCore_ZN.vol.medium.Xi[1],bui.znCore_ZN.vol.U,bui.znCore_ZN.vol.m,bui.znPerimeter_ZN_1.fmuZon.EGaiRad,bui.znPerimeter_ZN_1.vol.medium.Xi[1],bui.znPerimeter_ZN_1.vol.U,bui.znPerimeter_ZN_1.vol.m,bui.znPerimeter_ZN_2.fmuZon.EGaiRad,bui.znPerimeter_ZN_2.vol.medium.Xi[1],bui.znPerimeter_ZN_2.vol.U,bui.znPerimeter_ZN_2.vol.m,bui.znPerimeter_ZN_3.fmuZon.EGaiRad,bui.znPerimeter_ZN_3.vol.medium.Xi[1],bui.znPerimeter_ZN_3.vol.U,bui.znPerimeter_ZN_3.vol.m,bui.znPerimeter_ZN_4.fmuZon.EGaiRad,bui.znPerimeter_ZN_4.vol.medium.Xi[1],bui.znPerimeter_ZN_4.vol.U,bui.znPerimeter_ZN_4.vol.m,bui.terUni[1].conHea.I.y,bui.terUni[1].hexWetNtu.dryWetCalcs.fullyWet.TWatOutEst,bui.terUni[1].conCoo.I.y,bui.terUni[2].conHea.I.y,bui.terUni[2].hexWetNtu.dryWetCalcs.fullyWet.TWatOutEst,bui.terUni[2].conCoo.I.y,bui.terUni[3].conHea.I.y,bui.terUni[3].hexWetNtu.dryWetCalcs.fullyWet.TWatOutEst,bui.terUni[3].conCoo.I.y,bui.terUni[4].conHea.I.y,bui.terUni[4].hexWetNtu.dryWetCalcs.fullyWet.TWatOutEst,bui.terUni[4].conCoo.I.y,bui.terUni[5].conHea.I.y,bui.terUni[5].hexWetNtu.dryWetCalcs.fullyWet.TWatOutEst,bui.terUni[5].conCoo.I.y,bui.disFloHea.heaCoo.vol.dynBal.U,bui.disFloHea.senTSup.T,bui.disFloCoo.heaCoo.vol.dynBal.U,bui.disFloCoo.senTSup.T,bui.znAttic.fmuZon.EGaiRad,bui.znAttic.vol.medium.Xi[1],bui.znAttic.vol.U,bui.znAttic.vol.m)
 * Number of discrete variables: 118 ($whenCondition6,$whenCondition5,$whenCondition4,$whenCondition3,$whenCondition2,bui.znCore_ZN.fmuZon.TRad,bui.znCore_ZN.fmuZon.QLat_flow,bui.znCore_ZN.fmuZon.QPeo_flow,bui.znCore_ZN.fmuZon.yEP[1],bui.znCore_ZN.fmuZon.yEP[2],bui.znCore_ZN.fmuZon.yEP[3],bui.znCore_ZN.fmuZon.yEP[4],bui.znCore_ZN.fmuZon.yEP[5],bui.znCore_ZN.fmuZon.tNext,bui.znCore_ZN.fmuZon.tLast,bui.znCore_ZN.fmuZon.dtLast,bui.znCore_ZN.fmuZon.mInlet_flow,bui.znCore_ZN.fmuZon.TAveInlet,bui.znCore_ZN.fmuZon.TRooLast,bui.znCore_ZN.fmuZon.QGaiRadAve_flow,bui.znCore_ZN.fmuZon.EGaiRadLast,bui.znCore_ZN.fmuZon.QConLast_flow,bui.znPerimeter_ZN_1.fmuZon.TRad,bui.znPerimeter_ZN_1.fmuZon.QLat_flow,bui.znPerimeter_ZN_1.fmuZon.QPeo_flow,bui.znPerimeter_ZN_1.fmuZon.yEP[1],bui.znPerimeter_ZN_1.fmuZon.yEP[2],bui.znPerimeter_ZN_1.fmuZon.yEP[3],bui.znPerimeter_ZN_1.fmuZon.yEP[4],bui.znPerimeter_ZN_1.fmuZon.yEP[5],bui.znPerimeter_ZN_1.fmuZon.tNext,bui.znPerimeter_ZN_1.fmuZon.tLast,bui.znPerimeter_ZN_1.fmuZon.dtLast,bui.znPerimeter_ZN_1.fmuZon.mInlet_flow,bui.znPerimeter_ZN_1.fmuZon.TAveInlet,bui.znPerimeter_ZN_1.fmuZon.TRooLast,bui.znPerimeter_ZN_1.fmuZon.QGaiRadAve_flow,bui.znPerimeter_ZN_1.fmuZon.EGaiRadLast,bui.znPerimeter_ZN_1.fmuZon.QConLast_flow,bui.znPerimeter_ZN_2.fmuZon.TRad,bui.znPerimeter_ZN_2.fmuZon.QLat_flow,bui.znPerimeter_ZN_2.fmuZon.QPeo_flow,bui.znPerimeter_ZN_2.fmuZon.yEP[1],bui.znPerimeter_ZN_2.fmuZon.yEP[2],bui.znPerimeter_ZN_2.fmuZon.yEP[3],bui.znPerimeter_ZN_2.fmuZon.yEP[4],bui.znPerimeter_ZN_2.fmuZon.yEP[5],bui.znPerimeter_ZN_2.fmuZon.tNext,bui.znPerimeter_ZN_2.fmuZon.tLast,bui.znPerimeter_ZN_2.fmuZon.dtLast,bui.znPerimeter_ZN_2.fmuZon.mInlet_flow,bui.znPerimeter_ZN_2.fmuZon.TAveInlet,bui.znPerimeter_ZN_2.fmuZon.TRooLast,bui.znPerimeter_ZN_2.fmuZon.QGaiRadAve_flow,bui.znPerimeter_ZN_2.fmuZon.EGaiRadLast,bui.znPerimeter_ZN_2.fmuZon.QConLast_flow,bui.znPerimeter_ZN_3.fmuZon.TRad,bui.znPerimeter_ZN_3.fmuZon.QLat_flow,bui.znPerimeter_ZN_3.fmuZon.QPeo_flow,bui.znPerimeter_ZN_3.fmuZon.yEP[1],bui.znPerimeter_ZN_3.fmuZon.yEP[2],bui.znPerimeter_ZN_3.fmuZon.yEP[3],bui.znPerimeter_ZN_3.fmuZon.yEP[4],bui.znPerimeter_ZN_3.fmuZon.yEP[5],bui.znPerimeter_ZN_3.fmuZon.tNext,bui.znPerimeter_ZN_3.fmuZon.tLast,bui.znPerimeter_ZN_3.fmuZon.dtLast,bui.znPerimeter_ZN_3.fmuZon.mInlet_flow,bui.znPerimeter_ZN_3.fmuZon.TAveInlet,bui.znPerimeter_ZN_3.fmuZon.TRooLast,bui.znPerimeter_ZN_3.fmuZon.QGaiRadAve_flow,bui.znPerimeter_ZN_3.fmuZon.EGaiRadLast,bui.znPerimeter_ZN_3.fmuZon.QConLast_flow,bui.znPerimeter_ZN_4.fmuZon.TRad,bui.znPerimeter_ZN_4.fmuZon.QLat_flow,bui.znPerimeter_ZN_4.fmuZon.QPeo_flow,bui.znPerimeter_ZN_4.fmuZon.yEP[1],bui.znPerimeter_ZN_4.fmuZon.yEP[2],bui.znPerimeter_ZN_4.fmuZon.yEP[3],bui.znPerimeter_ZN_4.fmuZon.yEP[4],bui.znPerimeter_ZN_4.fmuZon.yEP[5],bui.znPerimeter_ZN_4.fmuZon.tNext,bui.znPerimeter_ZN_4.fmuZon.tLast,bui.znPerimeter_ZN_4.fmuZon.dtLast,bui.znPerimeter_ZN_4.fmuZon.mInlet_flow,bui.znPerimeter_ZN_4.fmuZon.TAveInlet,bui.znPerimeter_ZN_4.fmuZon.TRooLast,bui.znPerimeter_ZN_4.fmuZon.QGaiRadAve_flow,bui.znPerimeter_ZN_4.fmuZon.EGaiRadLast,bui.znPerimeter_ZN_4.fmuZon.QConLast_flow,$whenCondition1,bui.znAttic.fmuZon.TRad,bui.znAttic.fmuZon.QLat_flow,bui.znAttic.fmuZon.QPeo_flow,bui.znAttic.fmuZon.yEP[1],bui.znAttic.fmuZon.yEP[2],bui.znAttic.fmuZon.yEP[3],bui.znAttic.fmuZon.yEP[4],bui.znAttic.fmuZon.yEP[5],bui.znAttic.fmuZon.tNext,bui.znAttic.fmuZon.tLast,bui.znAttic.fmuZon.dtLast,bui.znAttic.fmuZon.mInlet_flow,bui.znAttic.fmuZon.TAveInlet,bui.znAttic.fmuZon.TRooLast,bui.znAttic.fmuZon.QGaiRadAve_flow,bui.znAttic.fmuZon.EGaiRadLast,bui.znAttic.fmuZon.QConLast_flow,$whenCondition11,$whenCondition10,$whenCondition9,$whenCondition8,$whenCondition7,bui.building.weaDat.locTim.tNext,bui.building.weaDat.conTimMin.tNext,bui.building.weaDat.conTim.tNext,bui.building.weaDat.eqnTim.tNext,bui.building.weaDat.decAng.tNext)
 * Number of discrete states: 35 (bui.building.weaDat.locTim.tNext,bui.building.weaDat.conTimMin.tNext,bui.building.weaDat.conTim.tNext,bui.building.weaDat.eqnTim.tNext,bui.building.weaDat.decAng.tNext,bui.znAttic.fmuZon.tNext,bui.znAttic.fmuZon.tLast,bui.znAttic.fmuZon.TAveInlet,bui.znAttic.fmuZon.EGaiRadLast,bui.znAttic.fmuZon.mInlet_flow,bui.znPerimeter_ZN_4.fmuZon.tNext,bui.znPerimeter_ZN_3.fmuZon.tNext,bui.znPerimeter_ZN_2.fmuZon.tNext,bui.znPerimeter_ZN_1.fmuZon.tNext,bui.znCore_ZN.fmuZon.tNext,bui.znPerimeter_ZN_4.fmuZon.tLast,bui.znPerimeter_ZN_4.fmuZon.TAveInlet,bui.znPerimeter_ZN_4.fmuZon.EGaiRadLast,bui.znPerimeter_ZN_4.fmuZon.mInlet_flow,bui.znPerimeter_ZN_3.fmuZon.tLast,bui.znPerimeter_ZN_3.fmuZon.TAveInlet,bui.znPerimeter_ZN_3.fmuZon.EGaiRadLast,bui.znPerimeter_ZN_3.fmuZon.mInlet_flow,bui.znPerimeter_ZN_2.fmuZon.tLast,bui.znPerimeter_ZN_2.fmuZon.TAveInlet,bui.znPerimeter_ZN_2.fmuZon.EGaiRadLast,bui.znPerimeter_ZN_2.fmuZon.mInlet_flow,bui.znPerimeter_ZN_1.fmuZon.tLast,bui.znPerimeter_ZN_1.fmuZon.TAveInlet,bui.znPerimeter_ZN_1.fmuZon.EGaiRadLast,bui.znPerimeter_ZN_1.fmuZon.mInlet_flow,bui.znCore_ZN.fmuZon.tLast,bui.znCore_ZN.fmuZon.TAveInlet,bui.znCore_ZN.fmuZon.EGaiRadLast,bui.znCore_ZN.fmuZon.mInlet_flow)
 * Number of clocked states: 0 ()
 * Top-level inputs: 0
Notification: Strong component statistics for simulation (1267):
 * Single equations (assignments): 1137
 * Array equations: 0
 * Algorithm blocks: 1
 * Record equations: 22
 * When equations: 83
 * If-equations: 0
 * Equation systems (not torn): 2
 * Torn equation systems: 22
 * Mixed (continuous/discrete) equation systems: 0
Notification: Equation system details (not torn):
 * Constant Jacobian (size): 0 systems
 * Linear Jacobian (size,density): 0 systems
 * Non-linear Jacobian (size): 2 systems
   {1, 1}
 * Without analytic Jacobian (size): 0 systems
Notification: Torn system details for strict tearing set:
 * Linear torn systems (#iteration vars, #inner vars, density): 11 systems
   {(1,2,100.0%), (1,2,100.0%), (1,2,100.0%), (1,2,100.0%), (1,2,100.0%), (1,2,100.0%), (1,2,100.0%), (1,2,100.0%), (1,2,100.0%), (1,2,100.0%), (1,2,100.0%)}
 * Non-linear torn systems (#iteration vars, #inner vars): 11 systems
   {(5,36), (4,37), (5,36), (5,36), (5,36), (1,1), (1,1), (1,1), (1,1), (1,1), (1,3)}
Notification: Performance of Backend phase and start with SimCode phase: time 0.01199/11.98, allocations: 2.844 MB / 4.233 GB, free: 1.018 GB / 2.233 GB
Notification: Performance of simCode: created initialization part: time 0.2218/12.2, allocations: 80.59 MB / 4.312 GB, free: 1.001 GB / 2.233 GB
Notification: Performance of simCode: created event and clocks part: time 2.82e-05/12.2, allocations: 16.06 kB / 4.312 GB, free: 1.001 GB / 2.233 GB
Notification: Performance of simCode: created simulation system equations: time 0.06342/12.26, allocations: 23.26 MB / 4.335 GB, free: 0.9942 GB / 2.233 GB
Notification: Performance of simCode: created of all other equations (e.g. parameter, nominal, assert, etc): time 0.08239/12.35, allocations: 13.82 MB / 4.348 GB, free: 0.9906 GB / 2.233 GB
Notification: Performance of simCode: created linear, non-linear and system jacobian parts: time 0.217/12.56, allocations: 85.88 MB / 4.432 GB, free: 0.9238 GB / 2.233 GB
Notification: Performance of simCode: some other stuff during SimCode phase: time 0.04722/12.61, allocations: 21.11 MB / 4.453 GB, free: 0.9031 GB / 2.233 GB
Notification: Performance of simCode: all other stuff during SimCode phase: time 0.01701/12.63, allocations: 2.389 MB / 4.455 GB, free: 0.9008 GB / 2.233 GB
Notification: Performance of SimCode: time 1.653e-06/12.63, allocations: 0 / 4.455 GB, free: 0.9008 GB / 2.233 GB
Notification: Performance of Templates: time 10.57/23.2, allocations: 5.545 GB / 10 GB, free: 0.5829 GB / 2.233 GB
"
[Timeout remaining time 277]
make -j1 -f Buildings_latest_Buildings.DHC.Loads.BaseClasses.Examples.CouplingSpawnZ6.makefile [Timeout 300]
make -j1 -f Buildings_latest_Buildings.DHC.Loads.BaseClasses.Examples.CouplingSpawnZ6.makefile clang++ -std=c++17  -fopenmp=libomp  -Winvalid-pch -O2 -g -DNDEBUG -fPIC   -std=c++11 -DBOOST_ALL_DYN_LINK   -DUSE_DGESV -DUSE_LOGGER -DOMC_BUILD -DUSE_THREAD -DSUNDIALS_MAJOR_VERSION=5 -DSUNDIALS_MINOR_VERSION=4 -DPMC_USE_SUNDIALS -I"." -I"/var/lib/jenkins1/ws/OpenModelicaLibraryTestingWork/OpenModelica/OMCompiler/build/bin/../include/omc/cpp/" -I. "-I/home/hudson/saved_omc/libraries/.openmodelica/libraries/Modelica 4.0.0+maint.om/Resources/C-Sources""-I/home/hudson/saved_omc/libraries/.openmodelica/libraries/Buildings 12.0.1-master/Resources/C-Sources" -I"." -I"." -I"/var/lib/jenkins1/ws/OpenModelicaLibraryTestingWork/OpenModelica/OMCompiler/build/include/omc/sundials" "-I/home/hudson/saved_omc/libraries/.openmodelica/libraries/Modelica 4.0.0+maint.om/Resources/C-Sources" "-I/home/hudson/saved_omc/libraries/.openmodelica/libraries/Buildings 12.0.1-master/Resources/C-Sources"    -DMEASURETIME_PROFILEBLOCKS -DUSE_LOGGER  -c -o OMCppBuildings_latest_Buildings.DHC.Loads.BaseClasses.Examples.CouplingSpawnZ6CalcHelperMain.o OMCppBuildings_latest_Buildings.DHC.Loads.BaseClasses.Examples.CouplingSpawnZ6CalcHelperMain.cpp
In file included from OMCppBuildings_latest_Buildings.DHC.Loads.BaseClasses.Examples.CouplingSpawnZ6CalcHelperMain.cpp:28:
./OMCppBuildings_latest_Buildings.DHC.Loads.BaseClasses.Examples.CouplingSpawnZ6Functions.cpp:3253:8: error: redefinition of 'runPeriod_' with a different type: 'int' vs 'const Buildings_ThermalZones_EnergyPlus__24__2__0_Data_RunPeriodType &'
   int runPeriod_.startDayOfYear__ext;
       ^
./OMCppBuildings_latest_Buildings.DHC.Loads.BaseClasses.Examples.CouplingSpawnZ6Functions.cpp:3245:343: note: previous definition is here
void Functions::Buildings_ThermalZones_EnergyPlus__24__2__0_BaseClasses_SpawnExternalObject_constructor(int objectType_, double startTime_, string modelicaNameBuilding_, string modelicaInstanceName_, string spawnExe_, string idfVersion_, string idfName_, string epwName_, const Buildings_ThermalZones_EnergyPlus__24__2__0_Data_RunPeriodType& runPeriod_, double relativeSurfaceTolerance_, string epName_, bool usePrecompiledFMU_, string fmuName_, string buildingsRootFileLocation_, int logLevel_, bool printUnit_, string jsonName_, string jsonKeysValues_, const BaseArray<string>& parOutNames_, const BaseArray<string>& parOutUnits_, int nParOut_, const BaseArray<string>& inpNames_, const BaseArray<string>& inpUnits_, int nInp_, const BaseArray<string>& outNames_, const BaseArray<string>& outUnits_, int nOut_, const BaseArray<int>& derivatives_structure_, int nDer_, const BaseArray<double>& derivatives_delta_, Buildings_ThermalZones_EnergyPlus__24__2__0_BaseClasses_SpawnExternalObject_constructorRetType& output)
                                                                                                                                                                                                                                                                                                                                                      ^
./OMCppBuildings_latest_Buildings.DHC.Loads.BaseClasses.Examples.CouplingSpawnZ6Functions.cpp:3253:18: error: expected ';' at end of declaration
   int runPeriod_.startDayOfYear__ext;
                 ^
                 ;
./OMCppBuildings_latest_Buildings.DHC.Loads.BaseClasses.Examples.CouplingSpawnZ6Functions.cpp:3254:8: error: redefinition of 'runPeriod_' with a different type: 'int' vs 'const Buildings_ThermalZones_EnergyPlus__24__2__0_Data_RunPeriodType &'
   int runPeriod_.applyWeekEndHolidayRule__ext;
       ^
./OMCppBuildings_latest_Buildings.DHC.Loads.BaseClasses.Examples.CouplingSpawnZ6Functions.cpp:3245:343: note: previous definition is here
void Functions::Buildings_ThermalZones_EnergyPlus__24__2__0_BaseClasses_SpawnExternalObject_constructor(int objectType_, double startTime_, string modelicaNameBuilding_, string modelicaInstanceName_, string spawnExe_, string idfVersion_, string idfName_, string epwName_, const Buildings_ThermalZones_EnergyPlus__24__2__0_Data_RunPeriodType& runPeriod_, double relativeSurfaceTolerance_, string epName_, bool usePrecompiledFMU_, string fmuName_, string buildingsRootFileLocation_, int logLevel_, bool printUnit_, string jsonName_, string jsonKeysValues_, const BaseArray<string>& parOutNames_, const BaseArray<string>& parOutUnits_, int nParOut_, const BaseArray<string>& inpNames_, const BaseArray<string>& inpUnits_, int nInp_, const BaseArray<string>& outNames_, const BaseArray<string>& outUnits_, int nOut_, const BaseArray<int>& derivatives_structure_, int nDer_, const BaseArray<double>& derivatives_delta_, Buildings_ThermalZones_EnergyPlus__24__2__0_BaseClasses_SpawnExternalObject_constructorRetType& output)
                                                                                                                                                                                                                                                                                                                                                      ^
./OMCppBuildings_latest_Buildings.DHC.Loads.BaseClasses.Examples.CouplingSpawnZ6Functions.cpp:3254:18: error: expected ';' at end of declaration
   int runPeriod_.applyWeekEndHolidayRule__ext;
                 ^
                 ;
./OMCppBuildings_latest_Buildings.DHC.Loads.BaseClasses.Examples.CouplingSpawnZ6Functions.cpp:3255:8: error: redefinition of 'runPeriod_' with a different type: 'int' vs 'const Buildings_ThermalZones_EnergyPlus__24__2__0_Data_RunPeriodType &'
   int runPeriod_.use_weatherFileDaylightSavingPeriod__ext;
       ^
./OMCppBuildings_latest_Buildings.DHC.Loads.BaseClasses.Examples.CouplingSpawnZ6Functions.cpp:3245:343: note: previous definition is here
void Functions::Buildings_ThermalZones_EnergyPlus__24__2__0_BaseClasses_SpawnExternalObject_constructor(int objectType_, double startTime_, string modelicaNameBuilding_, string modelicaInstanceName_, string spawnExe_, string idfVersion_, string idfName_, string epwName_, const Buildings_ThermalZones_EnergyPlus__24__2__0_Data_RunPeriodType& runPeriod_, double relativeSurfaceTolerance_, string epName_, bool usePrecompiledFMU_, string fmuName_, string buildingsRootFileLocation_, int logLevel_, bool printUnit_, string jsonName_, string jsonKeysValues_, const BaseArray<string>& parOutNames_, const BaseArray<string>& parOutUnits_, int nParOut_, const BaseArray<string>& inpNames_, const BaseArray<string>& inpUnits_, int nInp_, const BaseArray<string>& outNames_, const BaseArray<string>& outUnits_, int nOut_, const BaseArray<int>& derivatives_structure_, int nDer_, const BaseArray<double>& derivatives_delta_, Buildings_ThermalZones_EnergyPlus__24__2__0_BaseClasses_SpawnExternalObject_constructorRetType& output)
                                                                                                                                                                                                                                                                                                                                                      ^
./OMCppBuildings_latest_Buildings.DHC.Loads.BaseClasses.Examples.CouplingSpawnZ6Functions.cpp:3255:18: error: expected ';' at end of declaration
   int runPeriod_.use_weatherFileDaylightSavingPeriod__ext;
                 ^
                 ;
./OMCppBuildings_latest_Buildings.DHC.Loads.BaseClasses.Examples.CouplingSpawnZ6Functions.cpp:3256:8: error: redefinition of 'runPeriod_' with a different type: 'int' vs 'const Buildings_ThermalZones_EnergyPlus__24__2__0_Data_RunPeriodType &'
   int runPeriod_.use_weatherFileHolidaysAndSpecialDays__ext;
       ^
./OMCppBuildings_latest_Buildings.DHC.Loads.BaseClasses.Examples.CouplingSpawnZ6Functions.cpp:3245:343: note: previous definition is here
void Functions::Buildings_ThermalZones_EnergyPlus__24__2__0_BaseClasses_SpawnExternalObject_constructor(int objectType_, double startTime_, string modelicaNameBuilding_, string modelicaInstanceName_, string spawnExe_, string idfVersion_, string idfName_, string epwName_, const Buildings_ThermalZones_EnergyPlus__24__2__0_Data_RunPeriodType& runPeriod_, double relativeSurfaceTolerance_, string epName_, bool usePrecompiledFMU_, string fmuName_, string buildingsRootFileLocation_, int logLevel_, bool printUnit_, string jsonName_, string jsonKeysValues_, const BaseArray<string>& parOutNames_, const BaseArray<string>& parOutUnits_, int nParOut_, const BaseArray<string>& inpNames_, const BaseArray<string>& inpUnits_, int nInp_, const BaseArray<string>& outNames_, const BaseArray<string>& outUnits_, int nOut_, const BaseArray<int>& derivatives_structure_, int nDer_, const BaseArray<double>& derivatives_delta_, Buildings_ThermalZones_EnergyPlus__24__2__0_BaseClasses_SpawnExternalObject_constructorRetType& output)
                                                                                                                                                                                                                                                                                                                                                      ^
./OMCppBuildings_latest_Buildings.DHC.Loads.BaseClasses.Examples.CouplingSpawnZ6Functions.cpp:3256:18: error: expected ';' at end of declaration
   int runPeriod_.use_weatherFileHolidaysAndSpecialDays__ext;
                 ^
                 ;
./OMCppBuildings_latest_Buildings.DHC.Loads.BaseClasses.Examples.CouplingSpawnZ6Functions.cpp:3257:8: error: redefinition of 'runPeriod_' with a different type: 'int' vs 'const Buildings_ThermalZones_EnergyPlus__24__2__0_Data_RunPeriodType &'
   int runPeriod_.use_weatherFileRainIndicators__ext;
       ^
./OMCppBuildings_latest_Buildings.DHC.Loads.BaseClasses.Examples.CouplingSpawnZ6Functions.cpp:3245:343: note: previous definition is here
void Functions::Buildings_ThermalZones_EnergyPlus__24__2__0_BaseClasses_SpawnExternalObject_constructor(int objectType_, double startTime_, string modelicaNameBuilding_, string modelicaInstanceName_, string spawnExe_, string idfVersion_, string idfName_, string epwName_, const Buildings_ThermalZones_EnergyPlus__24__2__0_Data_RunPeriodType& runPeriod_, double relativeSurfaceTolerance_, string epName_, bool usePrecompiledFMU_, string fmuName_, string buildingsRootFileLocation_, int logLevel_, bool printUnit_, string jsonName_, string jsonKeysValues_, const BaseArray<string>& parOutNames_, const BaseArray<string>& parOutUnits_, int nParOut_, const BaseArray<string>& inpNames_, const BaseArray<string>& inpUnits_, int nInp_, const BaseArray<string>& outNames_, const BaseArray<string>& outUnits_, int nOut_, const BaseArray<int>& derivatives_structure_, int nDer_, const BaseArray<double>& derivatives_delta_, Buildings_ThermalZones_EnergyPlus__24__2__0_BaseClasses_SpawnExternalObject_constructorRetType& output)
                                                                                                                                                                                                                                                                                                                                                      ^
./OMCppBuildings_latest_Buildings.DHC.Loads.BaseClasses.Examples.CouplingSpawnZ6Functions.cpp:3257:18: error: expected ';' at end of declaration
   int runPeriod_.use_weatherFileRainIndicators__ext;
                 ^
                 ;
./OMCppBuildings_latest_Buildings.DHC.Loads.BaseClasses.Examples.CouplingSpawnZ6Functions.cpp:3258:8: error: redefinition of 'runPeriod_' with a different type: 'int' vs 'const Buildings_ThermalZones_EnergyPlus__24__2__0_Data_RunPeriodType &'
   int runPeriod_.use_weatherFileSnowIndicators__ext;
       ^
./OMCppBuildings_latest_Buildings.DHC.Loads.BaseClasses.Examples.CouplingSpawnZ6Functions.cpp:3245:343: note: previous definition is here
void Functions::Buildings_ThermalZones_EnergyPlus__24__2__0_BaseClasses_SpawnExternalObject_constructor(int objectType_, double startTime_, string modelicaNameBuilding_, string modelicaInstanceName_, string spawnExe_, string idfVersion_, string idfName_, string epwName_, const Buildings_ThermalZones_EnergyPlus__24__2__0_Data_RunPeriodType& runPeriod_, double relativeSurfaceTolerance_, string epName_, bool usePrecompiledFMU_, string fmuName_, string buildingsRootFileLocation_, int logLevel_, bool printUnit_, string jsonName_, string jsonKeysValues_, const BaseArray<string>& parOutNames_, const BaseArray<string>& parOutUnits_, int nParOut_, const BaseArray<string>& inpNames_, const BaseArray<string>& inpUnits_, int nInp_, const BaseArray<string>& outNames_, const BaseArray<string>& outUnits_, int nOut_, const BaseArray<int>& derivatives_structure_, int nDer_, const BaseArray<double>& derivatives_delta_, Buildings_ThermalZones_EnergyPlus__24__2__0_BaseClasses_SpawnExternalObject_constructorRetType& output)
                                                                                                                                                                                                                                                                                                                                                      ^
./OMCppBuildings_latest_Buildings.DHC.Loads.BaseClasses.Examples.CouplingSpawnZ6Functions.cpp:3258:18: error: expected ';' at end of declaration
   int runPeriod_.use_weatherFileSnowIndicators__ext;
                 ^
                 ;
./OMCppBuildings_latest_Buildings.DHC.Loads.BaseClasses.Examples.CouplingSpawnZ6Functions.cpp:3284:14: error: no member named 'startDayOfYear__ext' in 'Buildings_ThermalZones_EnergyPlus__24__2__0_Data_RunPeriodType'
  runPeriod_.startDayOfYear__ext = (int)runPeriod_.startDayOfYear_;
  ~~~~~~~~~~ ^
./OMCppBuildings_latest_Buildings.DHC.Loads.BaseClasses.Examples.CouplingSpawnZ6Functions.cpp:3285:14: error: no member named 'applyWeekEndHolidayRule__ext' in 'Buildings_ThermalZones_EnergyPlus__24__2__0_Data_RunPeriodType'
  runPeriod_.applyWeekEndHolidayRule__ext = (int)runPeriod_.applyWeekEndHolidayRule_;
  ~~~~~~~~~~ ^
./OMCppBuildings_latest_Buildings.DHC.Loads.BaseClasses.Examples.CouplingSpawnZ6Functions.cpp:3286:14: error: no member named 'use_weatherFileDaylightSavingPeriod__ext' in 'Buildings_ThermalZones_EnergyPlus__24__2__0_Data_RunPeriodType'
  runPeriod_.use_weatherFileDaylightSavingPeriod__ext = (int)runPeriod_.use_weatherFileDaylightSavingPeriod_;
  ~~~~~~~~~~ ^
./OMCppBuildings_latest_Buildings.DHC.Loads.BaseClasses.Examples.CouplingSpawnZ6Functions.cpp:3287:14: error: no member named 'use_weatherFileHolidaysAndSpecialDays__ext' in 'Buildings_ThermalZones_EnergyPlus__24__2__0_Data_RunPeriodType'
  runPeriod_.use_weatherFileHolidaysAndSpecialDays__ext = (int)runPeriod_.use_weatherFileHolidaysAndSpecialDays_;
  ~~~~~~~~~~ ^
./OMCppBuildings_latest_Buildings.DHC.Loads.BaseClasses.Examples.CouplingSpawnZ6Functions.cpp:3288:14: error: no member named 'use_weatherFileRainIndicators__ext' in 'Buildings_ThermalZones_EnergyPlus__24__2__0_Data_RunPeriodType'
  runPeriod_.use_weatherFileRainIndicators__ext = (int)runPeriod_.use_weatherFileRainIndicators_;
  ~~~~~~~~~~ ^
./OMCppBuildings_latest_Buildings.DHC.Loads.BaseClasses.Examples.CouplingSpawnZ6Functions.cpp:3289:14: error: no member named 'use_weatherFileSnowIndicators__ext' in 'Buildings_ThermalZones_EnergyPlus__24__2__0_Data_RunPeriodType'
  runPeriod_.use_weatherFileSnowIndicators__ext = (int)runPeriod_.use_weatherFileSnowIndicators_;
  ~~~~~~~~~~ ^
./OMCppBuildings_latest_Buildings.DHC.Loads.BaseClasses.Examples.CouplingSpawnZ6Functions.cpp:3298:236: error: no member named 'startDayOfYear__ext' in 'Buildings_ThermalZones_EnergyPlus__24__2__0_Data_RunPeriodType'; did you mean 'startDayOfYear_'?
  adapter__ext = allocate_Modelica_EnergyPlus_24_2_0(objectType__ext, startTime__ext, modelicaNameBuilding_.c_str(), modelicaInstanceName_.c_str(), spawnExe_.c_str(), idfVersion_.c_str(), idfName_.c_str(), epwName_.c_str(), runPeriod_.startDayOfYear__ext, runPeriod_.applyWeekEndHolidayRule__ext, runPeriod_.use_weatherFileDaylightSavingPeriod__ext, runPeriod_.use_weatherFileHolidaysAndSpecialDays__ext, runPeriod_.use_weatherFileRainIndicators__ext, runPeriod_.use_weatherFileSnowIndicators__ext, relativeSurfaceTolerance__ext, epName_.c_str(), usePrecompiledFMU__ext, fmuName_.c_str(), buildingsRootFileLocation_.c_str(), logLevel__ext, printUnit__ext, jsonName_.c_str(), jsonKeysValues_.c_str(), parOutNames__ext, nParOut__ext, parOutUnits__ext, nParOut__ext, inpNames__ext, nInp__ext, inpUnits__ext, nInp__ext, outNames__ext, nOut__ext, outUnits__ext, nOut__ext, tmp4103.getData(), 2, nDer__ext, ConstArray(derivatives_delta_).getData(), nDer__ext);
                                                                                                                                                                                                                                           ^~~~~~~~~~~~~~~~~~~
                                                                                                                                                                                                                                           startDayOfYear_
./OMCppBuildings_latest_Buildings.DHC.Loads.BaseClasses.Examples.CouplingSpawnZ6Types.h:50:7: note: 'startDayOfYear_' declared here
  int startDayOfYear_;
      ^
fatal error: too many errors emitted, stopping now [-ferror-limit=]
20 errors generated.
make: *** [<builtin>: OMCppBuildings_latest_Buildings.DHC.Loads.BaseClasses.Examples.CouplingSpawnZ6CalcHelperMain.o] Error 1
[Calling os._exit(0), Time elapsed: 32.67126031871885]
Failed to read output from testmodel.py, exit status != 0:
23.211003312841058 23.220811955 17.93155328
Calling exit ...
<OMPython.OMCSessionZMQ object at 0x7f2994f21810>